intro story D-Flow FM

 

D-Flow Flexible Mesh

D-Flow Flexible Mesh (D-Flow FM) is the new software engine for hydrodynamical simulations on unstructured grids in 1D-2D-3D. Together with the familiar curvilinear meshes from Delft3D 4, the unstructured grid can consist of triangles, pentagons (etc.) and 1D channel networks, all in one single mesh. It combines proven technology from the hydrodynamic engines of Delft3D 4 and SOBEK 2 and adds flexible administration, resulting in:

  • Easier 1D-2D-3D model coupling, intuitive setup of boundary conditions and meteorological forcings (amongst others).
  • More flexible 2D gridding in delta regions, river junctions, harbours, intertidal flats and more.
  • High performance by smart use of multicore architectures, and grid computing clusters.
An overview of the current developments can be found here.
 
The D-Flow FM - team would be delighted if you would participate in discussions on the generation of meshes, the specification of boundary conditions, the running of computations, and all kinds of other relevant topics. Feel free to share your smart questions and/or brilliant solutions! 

 

=======================================================
We have launched a new website (still under construction so expect continuous improvements) and a new forum dedicated to Delft3D Flexible Mesh.

Please follow this link to the new forum: 
/web/delft3dfm/forum

Post your questions, issues, suggestions, difficulties related to our Delft3D Flexible Mesh Suite on the new forum.

=======================================================

** PLEASE TAG YOUR POST! **

 

 

Sub groups
D-Flow Flexible Mesh
DELWAQ
Cohesive sediments & muddy systems

 


Message Boards

Compiling error

U
Astrid Stuer, modified 8 Years ago.

Compiling error

When compiling the source code I get the same error than explained in this post:
http://oss.deltares.nl/web/opendelft3d/od3dforums/-/message_boards/view_message/139909/maximized?_19_redirect=http%3A%2F%2Foss.deltares.nl%2Fweb%2Fopendelft3d%2Fod3dforums%2F-%2Fmessage_boards%2Fsearch%2Fmaximized%3F_19_keywords%3Dbenno%2Bwachler%26_19_searchCategoryId%3D0%26_19_breadcrumbsCategoryId%3D0%26_19_redirect%3Dhttp%253A%252F%252Foss.deltares.nl%252Fweb%252Fopendelft3d%252Fod3dforums%252F-%252Fmessage_boards%253Fp_p_state%253Dmaximized%2526_19_topLink%253Dmessage-boards-home
and here
http://oss.deltares.nl/web/opendelft3d/od3dforums/-/message_boards/view_message/141582/maximized?_19_redirect=http%3A%2F%2Foss.deltares.nl%2Fweb%2Fopendelft3d%2Fod3dforums%2F-%2Fmessage_boards%2Fsearch%2Fmaximized%3F_19_keywords%3Dbenno%2Bwachler%26_19_searchCategoryId%3D0%26_19_breadcrumbsCategoryId%3D0%26_19_redirect%3Dhttp%253A%252F%252Foss.deltares.nl%252Fweb%252Fopendelft3d%252Fod3dforums%252F-%252Fmessage_boards%253Fp_p_state%253Dmaximized%2526_19_topLink%253Dmessage-boards-home


I tried to fix the error by adding the path to the additional libraries in Visual Studio, but I am not sure if I did this right. The errors still occur.

In total I get 9 errors - I attached a screenshot.

Attachments:

Adri Mourits, modified 8 Years ago.

RE: Compiling error

Yoda Posts: 1221 Join Date: 1/3/11 Recent Posts
Hi Astrid,

Do you use VisualStudio2008 with Intel Visual Fortran Composer XE 2011 version 12?
In that case:
The following 5 files contain a reference to Intel 11 :
src\engines_gpl\flow2d3d\packages\flow2d3d\flow2d3d.vcproj
src\engines_gpl\flow2d3d\packages\flow2d3d_openda\flow2d3d_openda.vcproj
src\tools_gpl\datsel\packages\datsel\datsel.vcproj
src\tools_gpl\kubint\packages\kubint\kubint.vcproj
src\tools_gpl\lint\packages\lint\lint.vcproj

You can open them in a text editor and replace all occurences of "IFORT_COMPILER11" with "IFORT_COMPILER12".

If this does not help:
Your screenshot shows the contents of tab "Error List". Can you (by copy-paste) post the full contents of the tab "Output"?

Regards,

Adri
U
Astrid Stuer, modified 8 Years ago.

RE: Compiling error

Hi Adri,

unfortunately this did not work.
I still get the same 9 error meaasges.

This is the output from Visual Studio 2008:

------ Build started: Project: precision (utils_lgpl\precision\precision), Configuration: Release Win32 ------
Performing Pre-Build Event...
Generating version number in '.\src\precision_version.F90' ...
..\..\..\..\scripts_lgpl\win32\update_version.cmd: Regenerating existing file '.\src\precision_version.F90'.
Compiling with Intel(R) Visual Fortran Compiler XE 13.0.1.119 [IA-32]...
precision_version.F90
precision_basics.F90
precision.F90
precision_sp.F90
Creating library...

Build log written to "file://C:\delft3d_repository\src\utils_lgpl\precision\packages\precision\Release\BuildLog.txt"
precision - 0 error(s), 0 warning(s)
------ Build started: Project: mathconsts, Configuration: Release Win32 ------
Performing Pre-Build Event...
Generating version number in '.\src\mathconsts_version.F90' ...
..\..\..\..\scripts_lgpl\win32\update_version.cmd: Regenerating existing file '.\src\mathconsts_version.F90'.
Compiling with Intel(R) Visual Fortran Compiler XE 13.0.1.119 [IA-32]...
mathconsts_version.F90
mathconsts.f90
Creating library...

Build log written to "file://C:\delft3d_repository\src\utils_lgpl\constants\packages\mathconsts\Release\BuildLog.txt"
mathconsts - 0 error(s), 0 warning(s)
------ Build started: Project: delftio_version_number, Configuration: Release Win32 ------
Performing Pre-Build Event...
..\..\..\..\scripts_lgpl\win32\make_revision.bat: Regenerating existing file '.\include\version_number.h'.
..\..\..\..\scripts_lgpl\win32\make_revision.bat: executing c:\delft3d_repository\src\third_party_open\subversion\bin\win32\svnversion.exe -n
..\..\..\..\scripts_lgpl\win32\make_revision.bat: 2042
..\..\..\..\scripts_lgpl\win32\make_revision.bat: executing version_number.exe 2042 ".\include\version_number.ini" ".\include\version_number.h.svn" ".\include\version_number.h"
..\..\..\..\scripts_lgpl\win32\make_revision.bat: Regenerating existing file '.\include\version_number.rc'.
..\..\..\..\scripts_lgpl\win32\make_revision.bat: build exists
..\..\..\..\scripts_lgpl\win32\make_revision.bat: 2042
..\..\..\..\scripts_lgpl\win32\make_revision.bat: executing version_number.exe 2042 ".\include\version_number.ini" ".\include\version_number.rc.svn" ".\include\version_number.rc"
Compiling...
c2c.c
version.c
f2c.c
Creating library...
Build log was saved at "file://c:\delft3d_repository\src\utils_lgpl\delftio\packages\delftio_version_number\Release\BuildLog.htm"
delftio_version_number - 0 error(s), 0 warning(s)
------ Build started: Project: deltares_common_c, Configuration: Release Win32 ------
Compiling...
cutil.c
.\src\cutil.c(328) : warning C4029: declared formal parameter list different from definition
Compiling...
throwexception.cpp
.\src\throwexception.cpp(35) : warning C4297: 'THROWEXCEPTION' : function assumed not to throw an exception but does
__declspec(nothrow) or throw() was specified on the function
getputarray.cpp
.\src\getputarray.cpp(124) : warning C4996: 'unlink': The POSIX name for this item is deprecated. Instead, use the ISO C++ conformant name: _unlink. See online help for details.
c:\Program Files (x86)\Microsoft Visual Studio 9.0\VC\include\io.h(216) : see declaration of 'unlink'
.\src\getputarray.cpp(132) : warning C4244: 'argument' : conversion from 'double' to 'DWORD', possible loss of data
getopt.cpp
Creating library...
Build log was saved at "file://c:\delft3d_repository\src\utils_lgpl\deltares_common\packages\deltares_common_c\Release\BuildLog.htm"
deltares_common_c - 0 error(s), 4 warning(s)
------ Build started: Project: delftio_shm, Configuration: Release Win32 ------
Compiling...
cl : Command line warning D9035 : option 'Wp64' has been deprecated and will be removed in a future release
dio_shm.cpp
dio_shm_sync.cpp
dio_shm_handle.cpp
.\src\diof90\dio_shm_handle.cpp(115) : warning C4312: 'type cast' : conversion from 'unsigned int' to 'HANDLE' of greater size
dio_shm_f2c_c.cpp
.\src\diof90\dio_shm_f2c_c.cpp(138) : warning C4311: 'type cast' : pointer truncation from 'DioShmDs *' to 'long'
.\src\diof90\dio_shm_f2c_c.cpp(142) : warning C4312: 'type cast' : conversion from 'long' to 'DioShmDs *' of greater size
.\src\diof90\dio_shm_f2c_c.cpp(169) : warning C4311: 'type cast' : pointer truncation from 'DioShmDs *' to 'long'
.\src\diof90\dio_shm_f2c_c.cpp(173) : warning C4312: 'type cast' : conversion from 'long' to 'DioShmDs *' of greater size
.\src\diof90\dio_shm_f2c_c.cpp(188) : warning C4312: 'type cast' : conversion from 'long' to 'DioShmDs *' of greater size
.\src\diof90\dio_shm_f2c_c.cpp(203) : warning C4312: 'type cast' : conversion from 'long' to 'DioShmDs *' of greater size
.\src\diof90\dio_shm_f2c_c.cpp(217) : warning C4312: 'type cast' : conversion from 'long' to 'DioShmDs *' of greater size
.\src\diof90\dio_shm_f2c_c.cpp(230) : warning C4312: 'type cast' : conversion from 'long' to 'DioShmDs *' of greater size
.\src\diof90\dio_shm_f2c_c.cpp(238) : warning C4312: 'type cast' : conversion from 'long' to 'DioShmDs *' of greater size
.\src\diof90\dio_shm_f2c_c.cpp(247) : warning C4312: 'type cast' : conversion from 'long' to 'DioShmDs *' of greater size
.\src\diof90\dio_shm_f2c_c.cpp(255) : warning C4312: 'type cast' : conversion from 'long' to 'DioShmDs *' of greater size
.\src\diof90\dio_shm_f2c_c.cpp(269) : warning C4312: 'type cast' : conversion from 'long' to 'DioShmDs *' of greater size
.\src\diof90\dio_shm_f2c_c.cpp(279) : warning C4312: 'type cast' : conversion from 'long' to 'DioShmDs *' of greater size
.\src\diof90\dio_shm_f2c_c.cpp(289) : warning C4312: 'type cast' : conversion from 'long' to 'DioShmDs *' of greater size
.\src\diof90\dio_shm_f2c_c.cpp(298) : warning C4312: 'type cast' : conversion from 'long' to 'DioShmDs *' of greater size
.\src\diof90\dio_shm_f2c_c.cpp(309) : warning C4312: 'type cast' : conversion from 'long' to 'DioShmDs *' of greater size
.\src\diof90\dio_shm_f2c_c.cpp(323) : warning C4312: 'type cast' : conversion from 'long' to 'DioShmDs *' of greater size
.\src\diof90\dio_shm_f2c_c.cpp(333) : warning C4312: 'type cast' : conversion from 'long' to 'DioShmDs *' of greater size
.\src\diof90\dio_shm_f2c_c.cpp(343) : warning C4312: 'type cast' : conversion from 'long' to 'DioShmDs *' of greater size
.\src\diof90\dio_shm_f2c_c.cpp(352) : warning C4312: 'type cast' : conversion from 'long' to 'DioShmDs *' of greater size
.\src\diof90\dio_shm_f2c_c.cpp(363) : warning C4312: 'type cast' : conversion from 'long' to 'DioShmDs *' of greater size
dio_shm_datablock.cpp
Creating library...
Build log was saved at "file://c:\delft3d_repository\src\utils_lgpl\delftio\packages\delftio_shm\Release\BuildLog.htm"
delftio_shm - 0 error(s), 23 warning(s)
------ Build started: Project: semaphore (utils_lgpl\semaphore\semaphore), Configuration: Release Win32 ------
Performing Pre-Build Event...
Generating version number in '.\include\semaphore_version.h' ...
..\..\..\..\scripts_lgpl\win32\update_version.cmd: Regenerating existing file '.\include\semaphore_version.h'.
Compiling...
semaphore_version.cpp
sems.cpp
Creating library...
Build log was saved at "file://c:\delft3d_repository\src\utils_lgpl\semaphore\packages\semaphore\Release\BuildLog.htm"
semaphore - 0 error(s), 0 warning(s)
------ Build started: Project: deltares_common (utils_lgpl\deltares_common\deltares_common), Configuration: Release Win32 ------
Performing Pre-Build Event...
Generating version number in '.\src\deltares_common_version.F90' ...
..\..\..\..\scripts_lgpl\win32\update_version.cmd: Regenerating existing file '.\src\deltares_common_version.F90'.
Compiling with Intel(R) Visual Fortran Compiler XE 13.0.1.119 [IA-32]...
stringsequal.f90
small.f90
combinepaths.f90
juldat.f90
newunit.f90
MessageHandling.f90
deltares_common_version.F90
malloc.f90
handles.f90
nan_check_module.f90
buffer.f90
tables.f90
table_handles.f90
skipstarlines.f90
util.f90
scannr.f90
bilin5.f90
distance.f90
Creating library...
precision.lib(precision_version.obj) : warning LNK4006: _PRECISION_VERSION_MODULE. already defined in mathconsts.lib(precision_version.obj); second definition ignored
precision.lib(precision_version.obj) : warning LNK4006: _PRECISION_VERSION_MODULE_mp_GETFULLVERSIONSTRING_PRECISION already defined in mathconsts.lib(precision_version.obj); second definition ignored
precision.lib(precision_basics.obj) : warning LNK4006: _PRECISION_BASICS. already defined in mathconsts.lib(precision_basics.obj); second definition ignored
precision.lib(precision_basics.obj) : warning LNK4006: _PRECISION_BASICS_mp_COMPAREREALDOUBLE already defined in mathconsts.lib(precision_basics.obj); second definition ignored
precision.lib(precision_basics.obj) : warning LNK4006: _PRECISION_BASICS_mp_COMPAREREALSINGLE already defined in mathconsts.lib(precision_basics.obj); second definition ignored
precision.lib(precision.obj) : warning LNK4006: _PRECISION. already defined in mathconsts.lib(precision.obj); second definition ignored
precision.lib(precision_sp.obj) : warning LNK4006: _PRECISION_SP. already defined in mathconsts.lib(precision_sp.obj); second definition ignored

Build log written to "file://C:\delft3d_repository\src\utils_lgpl\deltares_common\packages\deltares_common\Release\BuildLog.txt"
deltares_common - 0 error(s), 7 warning(s)
------ Build started: Project: delftio_sync_version_number, Configuration: Release Win32 ------
Performing Pre-Build Event...
..\..\..\..\scripts_lgpl\win32\make_revision.bat: Regenerating existing file '.\include\version_number.h'.
..\..\..\..\scripts_lgpl\win32\make_revision.bat: executing c:\delft3d_repository\src\third_party_open\subversion\bin\win32\svnversion.exe -n
..\..\..\..\scripts_lgpl\win32\make_revision.bat: 2042
..\..\..\..\scripts_lgpl\win32\make_revision.bat: executing version_number.exe 2042 ".\include\version_number.ini" ".\include\version_number.h.svn" ".\include\version_number.h"
..\..\..\..\scripts_lgpl\win32\make_revision.bat: Regenerating existing file '.\include\version_number.rc'.
..\..\..\..\scripts_lgpl\win32\make_revision.bat: build exists
..\..\..\..\scripts_lgpl\win32\make_revision.bat: 2042
..\..\..\..\scripts_lgpl\win32\make_revision.bat: executing version_number.exe 2042 ".\include\version_number.ini" ".\include\version_number.rc.svn" ".\include\version_number.rc"
Compiling...
c2c.c
version.c
f2c.c
Creating library...
Build log was saved at "file://c:\delft3d_repository\src\utils_lgpl\delftio_sync\packages\delftio_sync_version_number\Release\BuildLog.htm"
delftio_sync_version_number - 0 error(s), 0 warning(s)
------ Build started: Project: delftio (utils_lgpl\delftio\delftio), Configuration: Release Win32 ------
Compiling with Intel(R) Visual Fortran Compiler XE 13.0.1.119 [IA-32]...
dio-check-nefis-error.F90
dio_shm_f2c_f.F90
dio-prop.F90
dio-ds-config.F90
dio-streams.F90
dio-ini.F90
dio-3d-block.F90
dio-ds.F90
dio-const-rw.F90
dio-2dfield-rw.F90
dio-plt-rw.F90
open_mi_dio.f90
dio-2dfield-nefis.F90
dio-sem-support.F90
dio-plt-nefis.F90
dio-2dfield-shm.F90
dio-time-support.F90
dio-plt-shm.F90
dio-sync.F90
dio-3d-block-nefis.F90
dio-sync-support.F90
dio-plt-f77.F90
Creating library...

Build log written to "file://C:\delft3d_repository\src\utils_lgpl\delftio\packages\delftio\Release\BuildLog.txt"
delftio - 0 error(s), 0 warning(s)
------ Build started: Project: delftio_sync (utils_lgpl\delftio_sync\delftio_sync), Configuration: Release Win32 ------
Compiling with Intel(R) Visual Fortran Compiler XE 13.0.1.119 [IA-32]...
putget_dio.f90
sync_rtcflow.f90
sync_flowwave.f90
sync_flm.f90
d3d_sobek_conf.f90
sync_couple.f90
d3d_sobek.f90
d3s_setup.f90
d3s_put_levels.f90
d3s_get_discharges.f90
Creating library...

Build log written to "file://C:\delft3d_repository\src\utils_lgpl\delftio_sync\packages\delftio_sync\Release\BuildLog.txt"
delftio_sync - 0 error(s), 0 warning(s)
------ Build started: Project: inifiles (utils_lgpl\inifiles\inifiles), Configuration: Release Win32 ------
Performing Pre-Build Event...
Generating version number in '.\src\inifiles_version.F90' ...
..\..\..\..\scripts_lgpl\win32\update_version.cmd: Regenerating existing file '.\src\inifiles_version.F90'.
Compiling with Intel(R) Visual Fortran Compiler XE 13.0.1.119 [IA-32]...
inifiles_version.F90
tree_struct.f90
properties.f90
Creating library...

Build log written to "file://C:\delft3d_repository\src\utils_lgpl\inifiles\packages\inifiles\Release\BuildLog.txt"
inifiles - 0 error(s), 0 warning(s)
------ Build started: Project: ec_module, Configuration: Release Win32 ------
Compiling with Intel(R) Visual Fortran Compiler XE 13.0.1.119 [IA-32]...
ec_typedefs.f90
ec_message.f90
ec_parameters.f90
ec_quantity.f90
ec_field.f90
ec_elementset.f90
ec_ecitem.f90
ec_connection.f90
ec_data.f90
ec_provider_read.F90
ec_provider.F90
ec_converter.f90
ec_module.f90
openexistingfile.f90
Creating library...

Build log written to "file://C:\delft3d_repository\src\utils_lgpl\ec_module\packages\ec_module\Release\BuildLog.htm"
ec_module - 0 error(s), 0 warning(s)
------ Build started: Project: meteo_version_number, Configuration: Release Win32 ------
Performing Pre-Build Event...
..\..\..\..\scripts_lgpl\win32\make_revision.bat: Regenerating existing file '.\include\version_number.h'.
..\..\..\..\scripts_lgpl\win32\make_revision.bat: executing c:\delft3d_repository\src\third_party_open\subversion\bin\win32\svnversion.exe -n
..\..\..\..\scripts_lgpl\win32\make_revision.bat: 2042
..\..\..\..\scripts_lgpl\win32\make_revision.bat: executing version_number.exe 2042 ".\include\version_number.ini" ".\include\version_number.h.svn" ".\include\version_number.h"
..\..\..\..\scripts_lgpl\win32\make_revision.bat: Regenerating existing file '.\include\version_number.rc'.
..\..\..\..\scripts_lgpl\win32\make_revision.bat: build exists
..\..\..\..\scripts_lgpl\win32\make_revision.bat: 2042
..\..\..\..\scripts_lgpl\win32\make_revision.bat: executing version_number.exe 2042 ".\include\version_number.ini" ".\include\version_number.rc.svn" ".\include\version_number.rc"
Compiling...
c2c.c
version.c
f2c.c
Creating library...
Build log was saved at "file://c:\delft3d_repository\src\utils_lgpl\meteo\packages\meteo_version_number\Release\BuildLog.htm"
meteo_version_number - 0 error(s), 0 warning(s)
------ Build started: Project: data (engines_gpl\flow2d3d\data), Configuration: Release Win32 ------
Compiling with Intel(R) Visual Fortran Compiler XE 13.0.1.119 [IA-32]...
adjlin.F90
message_module.f90
dfparall.F90
sp_buffer.f90
string_module.f90
bedcomposition_module.f90
globaldata.f90
flow_tables.f90
timers.f90
dffunctionals.F90
gdp_for_dll.f90
dfwaitr_nm_pos2.F90
dfsendnb.F90
initwrline.f90
initrestart.f90
initincbcc.f90
initadv2d.f90
gtlpnt.f90
dfupdr_nm_pos2.F90
dfrecvnb.F90
dfbroadc.F90
initu_ppr.f90
initfmtbct.f90
clrtrachy.f90
mkrpnt.f90
esm_alloc_real.f90
wrscr.F90
dfwrsedm.F90
dfupdd_nm_pos1.F90
dfgather_grddim.F90
griddims.f90
initsnel.f90
initdredge.f90
initcline.f90
clrdredge.f90
mkcpnt.f90
dfwaitr_nm_pos1.F90
dfsendi_nm_pos2.F90
initwrirst.f90
initprocs.f90
initincbc.f90
gtipnt.f90
dfupdr_nm_pos1.F90
dfpartit.F90
dfbladm.F90
inittrisol.f90
initfmtbcc.f90
initdischarge.f90
clrsedpar.f90
clrmorpar.f90
mklpnt.f90
esm_alloc_int.f90
strgrd.F90
dfwrsedh.F90
dfsync.F90
dfgather.F90
nefisio_dealloc.f90
initsedpar.f90
initmorpar.f90
initdpmveg.f90
initbubble.f90
clrbedformpar.f90
lnull.f90
dfwaiti_nm_pos2.F90
dfsendi_nm_pos1.F90
dfexitmpi.F90
initwaqpar.f90
initpostpr.f90
inithwid.f90
gdp_dump.f90
gtdpnt.f90
dfupdi_nm_pos2.F90
cparrr.F90
inittrachy.f90
initflwpar.f90
initdefsub.f90
clrmassbal.f90
esm_alloc_char.f90
rdencl.F90
dfwrmorm2.F90
dfstrip.F90
nefisio_alloc.f90
initscour.f90
initmassbal.f90
initbedformpar.f90
clradv2d.f90
inull.f90
dfwaiti_nm_pos1.F90
dfsendd_nm_pos2.F90
dfexchg.F90
initupddis.f90
initheat.f90
gdp_dealloc.f90
gtcpnt.f90
dnull.f90
dfupdi_nm_pos1.F90
dforb.F90
cparri.F90
inittimers.f90
initf0isf1.f90
initculver.f90
clrflwpar.f90
mkipnt.f90
errpnt.f90
initdfparall.F90
dfwrmorm1.F90
dfsendr_nm_pos2.F90
initzmodel.f90
initsafe.f90
initkeywtd.f90
initbcdat.f90
gtrpnt.f90
dfwaitd_nm_pos2.F90
dfsendd_nm_pos1.F90
dfdecomp.F90
initupdbct.f90
initfourier.f90
gdp_alloc_arrays.f90
getpointer.f90
decarr.f90
dfupdgeo.F90
dfmassc.F90
cparrd.F90
initstations.f90
initerosed.f90
initcrvout.f90
clrerosed.f90
mkfpnt.f90
dfwrsedmavg.F90
dfwrirst.F90
dfsendr_nm_pos1.F90
initz_initcg.f90
initrtc.f90
initincwav.f90
initarrays.f90
gtptrs.f90
dfwaitd_nm_pos1.F90
dfreduce.F90
dfcollect.F90
initupdbcc.f90
initfmtdis.f90
gdp_alloc.f90
rnull.f90
getlun.f90
chnull.f90
dfupdd_nm_pos2.F90
dfinitmpi.F90
initsobek.f90
initeqtran.f90
initcoup.f90
clreqtran.f90
mkdpnt.f90
Creating library...

Build log written to "file://C:\delft3d_repository\src\engines_gpl\flow2d3d\packages\data\Release\BuildLog.txt"
data - 0 error(s), 0 warning(s)
------ Build started: Project: meteo (utils_lgpl\meteo\meteo), Configuration: Release Win32 ------
Compiling with Intel(R) Visual Fortran Compiler XE 13.0.1.119 [IA-32]...
numbersonline_m.f90
meteo_data.f90
meteo_read.f90
meteo.f90
readmeteoheader.f90
distance2.f90
openexistingfile_meteo.f90
checkmeteoheader.f90
Creating library...
deltares_common.lib(precision_version.obj) : warning LNK4006: _PRECISION_VERSION_MODULE. already defined in deltares_common.lib(precision_version.obj); second definition ignored
deltares_common.lib(precision_version.obj) : warning LNK4006: _PRECISION_VERSION_MODULE_mp_GETFULLVERSIONSTRING_PRECISION already defined in deltares_common.lib(precision_version.obj); second definition ignored
deltares_common.lib(precision_basics.obj) : warning LNK4006: _PRECISION_BASICS. already defined in deltares_common.lib(precision_basics.obj); second definition ignored
deltares_common.lib(precision_basics.obj) : warning LNK4006: _PRECISION_BASICS_mp_COMPAREREALDOUBLE already defined in deltares_common.lib(precision_basics.obj); second definition ignored
deltares_common.lib(precision_basics.obj) : warning LNK4006: _PRECISION_BASICS_mp_COMPAREREALSINGLE already defined in deltares_common.lib(precision_basics.obj); second definition ignored
deltares_common.lib(precision.obj) : warning LNK4006: _PRECISION. already defined in deltares_common.lib(precision.obj); second definition ignored
deltares_common.lib(precision_sp.obj) : warning LNK4006: _PRECISION_SP. already defined in deltares_common.lib(precision_sp.obj); second definition ignored
precision.lib(precision_version.obj) : warning LNK4006: _PRECISION_VERSION_MODULE. already defined in deltares_common.lib(precision_version.obj); second definition ignored
precision.lib(precision_version.obj) : warning LNK4006: _PRECISION_VERSION_MODULE_mp_GETFULLVERSIONSTRING_PRECISION already defined in deltares_common.lib(precision_version.obj); second definition ignored
precision.lib(precision_basics.obj) : warning LNK4006: _PRECISION_BASICS. already defined in deltares_common.lib(precision_basics.obj); second definition ignored
precision.lib(precision_basics.obj) : warning LNK4006: _PRECISION_BASICS_mp_COMPAREREALDOUBLE already defined in deltares_common.lib(precision_basics.obj); second definition ignored
precision.lib(precision_basics.obj) : warning LNK4006: _PRECISION_BASICS_mp_COMPAREREALSINGLE already defined in deltares_common.lib(precision_basics.obj); second definition ignored
precision.lib(precision.obj) : warning LNK4006: _PRECISION. already defined in deltares_common.lib(precision.obj); second definition ignored
precision.lib(precision_sp.obj) : warning LNK4006: _PRECISION_SP. already defined in deltares_common.lib(precision_sp.obj); second definition ignored

Build log written to "file://C:\delft3d_repository\src\utils_lgpl\meteo\packages\meteo\Release\BuildLog.txt"
meteo - 0 error(s), 14 warning(s)
------ Build started: Project: io (engines_gpl\flow2d3d\io), Configuration: Release Win32 ------
Compiling with Intel(R) Visual Fortran Compiler XE 13.0.1.119 [IA-32]...
wrwaqnpnt.f90
wrwaqapnt.f90
wrwaqmakpnt.f90
wrwaqpnt.F90
polygon_module.f90
rdtdd.f90
kompbs.f90
wrwaqlenaggr.f90
wrsedh.f90
wridro.f90
putgtr.f90
fouana.f90
restart_lyrs.f90
rdtrafrm0.f90
rdmud.f90
rddredge.f90
grdfil.f90
dimdis.f90
rdeva.f90
zrtc.f90
wrwaqbal.f90
wrmorm2.f90
wrfou.f90
updbnddps.f90
prihis.f90
prhead.f90
defnewgrp.f90
reacmp.f90
rdsed1.f90
rdmassbal.f90
rdbcg.f90
dryfil.f90
cmpnum.f90
rdtold.f90
wrthis.f90
wrimap.f90
wrboun.f90
rwbotc_double.f90
ksieta2xy.f90
stafil.f90
rdusrp.f90
rdrgf.f90
rdibch.f90
rdhyg.f90
dimrd.f90
rdtdcn.f90
hulpgr.f90
wrwaqld0.f90
wrsedd.f90
wridoc.f90
putgtl.f90
findnm_kcs_flowwrapper.f90
restart_bodsed.f90
rdtrafrm.f90
rdmorlyr.f90
rddpmveg.f90
C:\delft3d_repository\src\engines_gpl\flow2d3d\packages\io\src\input\rddpmveg.f90(180): remark #8290: Recommended relationship between field width 'W' and the number of fractional digits 'D' in this edit descriptor is 'W>=D+3'.
flsfil.f90
dimbub.f90
rddis.f90
wrxbm.f90
wrmorm1.f90
wrdwqt.f90
update_stat_locations.f90
pppsol.f90
calbed.f90
rdxyzo.f90
rdsed0.f90
rdlaydis.f90
C:\delft3d_repository\src\engines_gpl\flow2d3d\packages\io\src\input\rdlaydis.f90(130): remark #8291: Recommended relationship between field width 'W' and the number of fractional digits 'D' in this edit descriptor is 'W>=D+7'.
C:\delft3d_repository\src\engines_gpl\flow2d3d\packages\io\src\input\rdlaydis.f90(323): remark #8291: Recommended relationship between field width 'W' and the number of fractional digits 'D' in this edit descriptor is 'W>=D+7'.
C:\delft3d_repository\src\engines_gpl\flow2d3d\packages\io\src\input\rdlaydis.f90(328): remark #8291: Recommended relationship between field width 'W' and the number of fractional digits 'D' in this edit descriptor is 'W>=D+7'.
C:\delft3d_repository\src\engines_gpl\flow2d3d\packages\io\src\input\rdlaydis.f90(343): remark #8291: Recommended relationship between field width 'W' and the number of fractional digits 'D' in this edit descriptor is 'W>=D+7'.
C:\delft3d_repository\src\engines_gpl\flow2d3d\packages\io\src\input\rdlaydis.f90(347): remark #8291: Recommended relationship between field width 'W' and the number of fractional digits 'D' in this edit descriptor is 'W>=D+7'.
drofil.f90
ck_dpopt.f90
rdtdtn.f90
rdbcq.f90
wrtdro.f90
wrihisdis.f90
wavenr.f90
rwbotc.f90
inippr.f90
srcfil.f90
rdusrf.f90
rdq2eb.f90
rdhyb.f90
dimpro.f90
rdtdc.f90
datumi.f90
wrwaqhyd.f90
wrrouf.f90
wribot.f90
putgti.f90
findnm_kcs.f90
restart_bdf_from_trim.f90
rdtimo.f90
rdmor1.f90
rddept.f90
flow_nefis_restart.f90
dimbnd.f90
rdbct.f90
wrwavh.f90
wrtmap.f90
wrmorm.f90
wrcurt.f90
tstat_bed.f90
postpr_hdt.f90
addelm.f90
rdsed.f90
rdiwe.f90
numcmp.f90
dimtrt.f90
ciofil.f90
rdtdt.f90
rdbch.f90
wrspcp.f90
wrsedmgrp.f90
wrihisdad.f90
waq2flow.f90
rstcom.f90
getfpt.f90
search2.f90
rdusrc.f90
rdproc.f90
rdgrid.f90
dimmud.f90
rdqh.f90
bewvuf.f90
wrwaqflo.f90
wrrolm.f90
wrgrid.f90
putgtc.f90
filldm.f90
reafou.f90
rdstru.f90
rdmor0.f90
rdcul.f90
fbcorr.f90
dimbch.f90
wrtbch.f90
wrwaqvol.f90
wrthisdis.f90
wrkent.f90
wrcomwind.f90
tstat.f90
postpr.f90
trafil.f90
rdscour.f90
rdirt.f90
morbndfill.f90
dimstr.f90
bubfil.f90
rdtdf.f90
rdbcc.f90
wrwaqload.f90
C:\delft3d_repository\src\engines_gpl\flow2d3d\packages\io\src\output\wrwaqload.f90(196): remark #8291: Recommended relationship between field width 'W' and the number of fractional digits 'D' in this edit descriptor is 'W>=D+7'.
wrsedwaqm.f90
wrsedmavg.f90
wrihisbal.f90
uv2zeta.f90
rdtimw.f90
frdint.f90
rstfil.f90
rdttar.f90
rdprfl.f90
rdfour.f90
icfil.f90
dimiwe.f90
rdnamc.f90
bchfil.f90
wrwaqfil.F90
wrplot.f90
wrfouv.f90
prtmap.f90
dp999.f90
readmd.f90
rdspec.f90
rdmor.f90
rdbndd.f90
expblk.f90
depfil_double.f90
tdatom.f90
wrwaqsrf.F90
wrthisdad.f90
wrkenc.f90
wrcomt.f90
tcross.f90
pinpol.f90
tdfil.f90
rdrund.f90
rdinimorlyr.f90
inimet.f90
dimsit.f90
bndfil.f90
rdtddn.f90
rdbcb.f90
wrwaqlennoag.f90
wrsedm.f90
wrihis.f90
rdtimc.f90
fouvecmax.f90
roller_nefis_restart.f90
rdtrt.f90
rdnum.f90
rdfcio.f90
hybfil.f90
dimfou.f90
rdheat.f90
asc.f90
wrwaqcco.F90
wrparm.f90
wrfous.f90
prthis.f90
dirint.f90
read_triana.f90
rdsite.f90
rdmeteo.f90
rdbedformpar.f90
edyfil.f90
depfil.f90
rwbcb.f90
wrthisbal.f90
wrirst.f90
wrcomi.f90
setwav.f90
layer_interfaces.f90
strfil.f90
rdwaqpar.f90
rdroll.f90
rdic.f90
rdhyvd.f90
inicut.f90
dimsedconst.f90
barfil.f90
Creating library...

Build log written to "file://C:\delft3d_repository\src\engines_gpl\flow2d3d\packages\io\Release\BuildLog.txt"
io - 0 error(s), 0 warning(s)
------ Build started: Project: nefis_version_number, Configuration: Release Win32 ------
Performing Pre-Build Event...
..\..\..\..\scripts_lgpl\win32\make_revision.bat: Regenerating existing file '.\include\version_number.h'.
..\..\..\..\scripts_lgpl\win32\make_revision.bat: executing c:\delft3d_repository\src\third_party_open\subversion\bin\win32\svnversion.exe -n
..\..\..\..\scripts_lgpl\win32\make_revision.bat: 2042
..\..\..\..\scripts_lgpl\win32\make_revision.bat: executing version_number.exe 2042 ".\include\version_number.ini" ".\include\version_number.h.svn" ".\include\version_number.h"
..\..\..\..\scripts_lgpl\win32\make_revision.bat: Regenerating existing file '.\include\version_number.rc'.
..\..\..\..\scripts_lgpl\win32\make_revision.bat: build exists
..\..\..\..\scripts_lgpl\win32\make_revision.bat: 2042
..\..\..\..\scripts_lgpl\win32\make_revision.bat: executing version_number.exe 2042 ".\include\version_number.ini" ".\include\version_number.rc.svn" ".\include\version_number.rc"
Compiling...
c2c.c
version.c
f2c.c
Creating library...
Build log was saved at "file://c:\delft3d_repository\src\utils_lgpl\nefis\packages\nefis_version_number\Release\BuildLog.htm"
nefis_version_number - 0 error(s), 0 warning(s)
------ Build started: Project: kernel_dd_f, Configuration: Release Win32 ------
Compiling with Intel(R) Visual Fortran Compiler XE 13.0.1.119 [IA-32]...
flow_nextstep.f90
Creating library...

Build log written to "file://C:\delft3d_repository\src\engines_gpl\flow2d3d\packages\kernel_dd_f\Release\BuildLog.txt"
kernel_dd_f - 0 error(s), 0 warning(s)
------ Build started: Project: nefis (utils_lgpl\nefis\nefis), Configuration: Release Win32 ------
Compiling...
c2c.c
wl-xdr.c
rt.c
pt.c
oc.c
.\src\oc.c(74) : warning C4005: 'FILE_READ_ONLY' : macro redefinition
C:\Program Files\Microsoft SDKs\Windows\v6.0A\include\winbase.h(5472) : see previous definition of 'FILE_READ_ONLY'
hs.c
gt.c
gp.c
f2c.c
er.c
df.c
.\src\df.c(309) : warning C4018: '<' : signed/unsigned mismatch
.\src\df.c(310) : warning C4018: '<' : signed/unsigned mismatch
.\src\df.c(316) : warning C4018: '<' : signed/unsigned mismatch
.\src\df.c(317) : warning C4018: '<' : signed/unsigned mismatch
.\src\df.c(614) : warning C4018: '<' : signed/unsigned mismatch
.\src\df.c(615) : warning C4018: '<' : signed/unsigned mismatch
.\src\df.c(621) : warning C4018: '<' : signed/unsigned mismatch
.\src\df.c(622) : warning C4018: '<' : signed/unsigned mismatch
.\src\df.c(875) : warning C4018: '<' : signed/unsigned mismatch
.\src\df.c(880) : warning C4018: '<' : signed/unsigned mismatch
.\src\df.c(1230) : warning C4018: '<' : signed/unsigned mismatch
.\src\df.c(1239) : warning C4018: '<' : signed/unsigned mismatch
Creating library...
Replacing .\Release\c2c.obj
Replacing .\Release\f2c.obj
Build log was saved at "file://c:\delft3d_repository\src\utils_lgpl\nefis\packages\nefis\Release\BuildLog.htm"
nefis - 0 error(s), 13 warning(s)
------ Build started: Project: plugin_user, Configuration: Release Win32 ------
Compiling with Intel(R) Visual Fortran Compiler XE 13.0.1.119 [IA-32]...
u_wmap.f90
C:\delft3d_repository\src\engines_gpl\flow2d3d\packages\plugin_user\src\u_wmap.f90(165): remark #8291: Recommended relationship between field width 'W' and the number of fractional digits 'D' in this edit descriptor is 'W>=D+7'.
C:\delft3d_repository\src\engines_gpl\flow2d3d\packages\plugin_user\src\u_wmap.f90(165): remark #8291: Recommended relationship between field width 'W' and the number of fractional digits 'D' in this edit descriptor is 'W>=D+7'.
C:\delft3d_repository\src\engines_gpl\flow2d3d\packages\plugin_user\src\u_wmap.f90(168): remark #8291: Recommended relationship between field width 'W' and the number of fractional digits 'D' in this edit descriptor is 'W>=D+7'.
C:\delft3d_repository\src\engines_gpl\flow2d3d\packages\plugin_user\src\u_wmap.f90(168): remark #8291: Recommended relationship between field width 'W' and the number of fractional digits 'D' in this edit descriptor is 'W>=D+7'.
usrptr.f90
u_whis.f90
C:\delft3d_repository\src\engines_gpl\flow2d3d\packages\plugin_user\src\u_whis.f90(184): remark #8291: Recommended relationship between field width 'W' and the number of fractional digits 'D' in this edit descriptor is 'W>=D+7'.
usrdef.f90
u_wdro.f90
urdrgs.f90
u_rdat.f90
urdbcc.f90
u_ppr.f90
uckbcc.f90
Creating library...

Build log written to "file://C:\delft3d_repository\src\engines_gpl\flow2d3d\packages\plugin_user\Release\BuildLog.txt"
plugin_user - 0 error(s), 0 warning(s)
------ Build started: Project: io_dol_f, Configuration: Release Win32 ------
Compiling with Intel(R) Visual Fortran Compiler XE 13.0.1.119 [IA-32]...
d3donline.f90
d3d_olv_class.f90
d3dpublish.f90
Creating library...

Build log written to "file://C:\delft3d_repository\src\engines_gpl\flow2d3d\packages\io_dol_f\Release\BuildLog.txt"
io_dol_f - 0 error(s), 0 warning(s)
------ Build started: Project: kernel (engines_gpl\flow2d3d\kernel), Configuration: Release Win32 ------
Compiling with Intel(R) Visual Fortran Compiler XE 13.0.1.119 [IA-32]...
open_datdef.f90
modlen.f90
d3d_in_openda.f90
incwav.f90
iwe_00.f90
z_solbicgstab.f90
C:\delft3d_repository\src\engines_gpl\flow2d3d\packages\kernel\src\non_hydro\z_solbicgstab.f90(494): remark #8291: Recommended relationship between field width 'W' and the number of fractional digits 'D' in this edit descriptor is 'W>=D+7'.
C:\delft3d_repository\src\engines_gpl\flow2d3d\packages\kernel\src\non_hydro\z_solbicgstab.f90(499): remark #8291: Recommended relationship between field width 'W' and the number of fractional digits 'D' in this edit descriptor is 'W>=D+7'.
z_inizm.f90
inigrd.f90
chkvic.f90
sortindices.f90
pldep.F90
flhnew.f90
area4.f90
upwbed.f90
termgy.f90
compsandfrac.f90
varcon.f90
wri_cormix.f90
z_predict_nhfull.f90
vihsec.f90
tratur.f90
reddic.f90
euler.f90
dengra.f90
c_vort.f90
updtem.f90
incbcc.f90
z_lu.f90
iwecof.f90
inibct.f90
chkset.f90
caldps.f90
readnr.f90
nm_to_n_and_m.f90
dtn.f90
tranb3.f90
red_soursin.f90
bott3d.f90
rbsig.f90
dis_qjet.f90
z_disbub.f90
usrbcc.f90
sud.f90
mom_cw.f90
difuvl.f90
cptdis.f90
updbcc.f90
totiwe.f90
ampiwe.f90
z_trisol_nhfull.f90
initau.f90
inchki.f90
chkic.f90
txtmrk.f90
read1r.f90
ipon.f90
dattim.f90
inigeo_dd.f90
trabg.f90
eqtran.f90
bailtr.f90
le.f90
z_uzd.f90
z_cucnp.f90
turclo.f90
slim.f90
heatu.f90
detvic.f90
caltmx.f90
inctem.f90
intpol.f90
z_precon_ilu.f90
z_initur.f90
inigeo.f90
chktrt.f90
chkdis.f90
setlun.f90
filfmt.f90
angle.f90
updwaqflxsed.f90
termfy.f90
comphidexp.f90
turwav.f90
near_field.f90
z_impl_upw.f90
vihrov.f90
trakad.f90
protke.f90
enloss.f90
curvat.f90
bedform.f90
updeva.f90
incbc.f90
z_initcg_nhfull.f90
inivol.f90
inibcq.f90
chkphy.f90
allocadv2d.f90
readni.f90
nm_to_diag.f90
dittar.f90
tranb2.f90
osmom.f90
bndmorlyr.f90
radstr.f90
desa.f90
z_difuv_nhfull.f90
upwhu.f90
stress.f90
lpfluc.f90
difuflux.f90
comvol.f90
update_nodal_factors.f90
tg.f90
z_vermom_nhfull.f90
z_trisol.f90
inised.f90
getdy.f90
chkgeo.f90
tmpcheck.f90
read1i.f90
iniid.f90
d3stop.f90
chkrefinement.f90
trab14.f90
dwnvel.f90
avalan.f90
hds_wf.f90
z_updtvol.f90
z_cucbp_nhfull.f90
tur2d.f90
shrwav.f90
forfil.f90
dersig.f90
calrou.f90
incrbc.f90
distri.f90
C:\delft3d_repository\src\engines_gpl\flow2d3d\packages\kernel\src\taylor\distri.f90(149): remark #8291: Recommended relationship between field width 'W' and the number of fractional digits 'D' in this edit descriptor is 'W>=D+7'.
C:\delft3d_repository\src\engines_gpl\flow2d3d\packages\kernel\src\taylor\distri.f90(151): remark #8291: Recommended relationship between field width 'W' and the number of fractional digits 'D' in this edit descriptor is 'W>=D+7'.
z_precon.f90
z_chkdry.f90
inieva.f90
chktra.f90
chkcom.f90
setcurrentdatetime.f90
nuliar.f90
exifil.f90
xzyz_dd.f90
upbdps.f90
soursin_3d.f90
compdiam.f90
tapf.f90
jet3d2flow.f90
z_forfil.f90
uzd.f90
thahbc.f90
mom_waqua.f90
drychk.f90
culver.f90
bccorr.f90
upddpmveg.f90
eoferr.f90
z_initcg.f90
initur.f90
inibcparl.f90
chknum.f90
z_ainpro.f90
readnc.f90
newlun.f90
distance_gdp.f90
tranb1.f90
getfixfac.f90
bedtr2004.f90
qkwcg.f90
cormix2flow.f90
z_difuflux.f90
updwaqflx.f90
stoktb.f90
layerdep.f90
difu.f90
cnvbub.f90
rtc_comm_put.f90
taylor.f90
C:\delft3d_repository\src\engines_gpl\flow2d3d\packages\kernel\src\taylor\taylor.f90(256): remark #8291: Recommended relationship between field width 'W' and the number of fractional digits 'D' in this edit descriptor is 'W>=D+7'.
C:\delft3d_repository\src\engines_gpl\flow2d3d\packages\kernel\src\taylor\taylor.f90(257): remark #8291: Recommended relationship between field width 'W' and the number of fractional digits 'D' in this edit descriptor is 'W>=D+7'.
C:\delft3d_repository\src\engines_gpl\flow2d3d\packages\kernel\src\taylor\taylor.f90(266): remark #8291: Recommended relationship between field width 'W' and the number of fractional digits 'D' in this edit descriptor is 'W>=D+7'.
C:\delft3d_repository\src\engines_gpl\flow2d3d\packages\kernel\src\taylor\taylor.f90(268): remark #8291: Recommended relationship between field width 'W' and the number of fractional digits 'D' in this edit descriptor is 'W>=D+7'.
C:\delft3d_repository\src\engines_gpl\flow2d3d\packages\kernel\src\taylor\taylor.f90(270): remark #8291: Recommended relationship between field width 'W' and the number of fractional digits 'D' in this edit descriptor is 'W>=D+7'.
C:\delft3d_repository\src\engines_gpl\flow2d3d\packages\kernel\src\taylor\taylor.f90(272): remark #8291: Recommended relationship between field width 'W' and the number of fractional digits 'D' in this edit descriptor is 'W>=D+7'.
C:\delft3d_repository\src\engines_gpl\flow2d3d\packages\kernel\src\taylor\taylor.f90(274): remark #8291: Recommended relationship between field width 'W' and the number of fractional digits 'D' in this edit descriptor is 'W>=D+7'.
C:\delft3d_repository\src\engines_gpl\flow2d3d\packages\kernel\src\taylor\taylor.f90(297): remark #8291: Recommended relationship between field width 'W' and the number of fractional digits 'D' in this edit descriptor is 'W>=D+7'.
C:\delft3d_repository\src\engines_gpl\flow2d3d\packages\kernel\src\taylor\taylor.f90(299): remark #8291: Recommended relationship between field width 'W' and the number of fractional digits 'D' in this edit descriptor is 'W>=D+7'.
C:\delft3d_repository\src\engines_gpl\flow2d3d\packages\kernel\src\taylor\taylor.f90(301): remark #8291: Recommended relationship between field width 'W' and the number of fractional digits 'D' in this edit descriptor is 'W>=D+7'.
C:\delft3d_repository\src\engines_gpl\flow2d3d\packages\kernel\src\taylor\taylor.f90(305): remark #8291: Recommended relationship between field width 'W' and the number of fractional digits 'D' in this edit descriptor is 'W>=D+7'.
z_vermom.f90
trisol.f90
inirgl.f90
getdx.f90
chkdry.f90
timdat.f90
read1c.f90
getcel.f90
copykcuv.f90
chkdry_dd.f90
trab12.f90
dredgedump.f90
adjust_bedload.f90
hds.f90
z_turclo.f90
z_checku.f90
trtrou.f90
secrhs.f90
filterstructures.f90
dens_unes.f90
calksc.f90
windtostress.f90
incmeteo.f90
disper.f90
z_momcor_nhfull.f90
xyder.f90
inidis.f90
chktim.f90
chkbnd.f90
search.f90
nointextspaces.f90
evenquotes.f90
wangp3.f90
tranb7.f90
soursin_2d.f90
compbsskin.f90
snel.f90
interp_tk.f90
z_expl_dir_upw.f90
ustar.f90
tfzeta.f90
drotim.f90
cucnp.f90
adv2d.f90
upddis.f90
cofrbc.f90
z_ilu_nhfull.f90
initmerge.f90
inibcc.f90
chklod.f90
wrline.f90
read2r.f90
n_and_m_to_nm.f90
delnef.f90
tran9t.f90
fgyint.f90
bedtr1993.f90
qkwbn.f90
corinp_gen.f90
z_difu.f90
updmassbal.f90
sousin.f90
itadi2.f90
difhor.f90
cline.f90
rtc_comm_init.f90
suriwe.f90
C:\delft3d_repository\src\engines_gpl\flow2d3d\packages\kernel\src\taylor\suriwe.f90(291): remark #8291: Recommended relationship between field width 'W' and the number of fractional digits 'D' in this edit descriptor is 'W>=D+7'.
C:\delft3d_repository\src\engines_gpl\flow2d3d\packages\kernel\src\taylor\suriwe.f90(293): remark #8291: Recommended relationship between field width 'W' and the number of fractional digits 'D' in this edit descriptor is 'W>=D+7'.
C:\delft3d_repository\src\engines_gpl\flow2d3d\packages\kernel\src\taylor\suriwe.f90(294): remark #8291: Recommended relationship between field width 'W' and the number of fractional digits 'D' in this edit descriptor is 'W>=D+7'.
C:\delft3d_repository\src\engines_gpl\flow2d3d\packages\kernel\src\taylor\suriwe.f90(295): remark #8291: Recommended relationship between field width 'W' and the number of fractional digits 'D' in this edit descriptor is 'W>=D+7'.
C:\delft3d_repository\src\engines_gpl\flow2d3d\packages\kernel\src\taylor\suriwe.f90(297): remark #8291: Recommended relationship between field width 'W' and the number of fractional digits 'D' in this edit descriptor is 'W>=D+7'.
C:\delft3d_repository\src\engines_gpl\flow2d3d\packages\kernel\src\taylor\suriwe.f90(299): remark #8291: Recommended relationship between field width 'W' and the number of fractional digits 'D' in this edit descriptor is 'W>=D+7'.
C:\delft3d_repository\src\engines_gpl\flow2d3d\packages\kernel\src\taylor\suriwe.f90(301): remark #8291: Recommended relationship between field width 'W' and the number of fractional digits 'D' in this edit descriptor is 'W>=D+7'.
C:\delft3d_repository\src\engines_gpl\flow2d3d\packages\kernel\src\taylor\suriwe.f90(305): remark #8291: Recommended relationship between field width 'W' and the number of fractional digits 'D' in this edit descriptor is 'W>=D+7'.
z_solcg_nhfull.f90
C:\delft3d_repository\src\engines_gpl\flow2d3d\packages\kernel\src\non_hydro\z_solcg_nhfull.f90(382): remark #8291: Recommended relationship between field width 'W' and the number of fractional digits 'D' in this edit descriptor is 'W>=D+7'.
C:\delft3d_repository\src\engines_gpl\flow2d3d\packages\kernel\src\non_hydro\z_solcg_nhfull.f90(387): remark #8291: Recommended relationship between field width 'W' and the number of fractional digits 'D' in this edit descriptor is 'W>=D+7'.
sysini.f90
iniphy.f90
chkdro.f90
step_to_screen.f90
prtnefiserr.f90
fouini.f90
checkmeteoresult.f90
caldpu_dd.f90
trab11.f90
dredge.f90
wnr.f90
difuwe.f90
constwave.f90
z_tratur.f90
z_adi.f90
tritra.f90
secbou.f90
fallve.f90
dens_eck.f90
calbf.f90
windtogridc.f90
inceva.f90
brksur.f90
z_momcor.f90
tkecof.f90
inicdw.f90
chkstr.f90
calpsh.f90
rmdel.f90
noextspaces.f90
errmsg.f90
wangp1.f90
tranb5.f90
shld.f90
calseddf2004.f90
rollu.f90
findnmk.f90
z_drychk.f90
usrbrl2d.f90
taubot.f90
mom_fls.f90
discha.f90
cucdp.f90
adi.f90
updbct.f90
zbrent.f90
z_hydpres_nhfull.f90
initgf.f90
increm.f90
chkkc.f90
vermdf.f90
read2i.f90
delfil.f90
trabwc2.f90
erosilt.f90
bedbc2004.f90
orbvel.f90
z_vihrov.f90
z_difhor_nhfull.f90
updbar.f90
sourmu.f90
interp.f90
difacr.f90
checku.f90
rtc_comm_get.f90
seliwe.f90
z_solcg.f90
z_kfmnmx.f90
inimorlyr.f90
creategridborder.f90
srckey.f90
prterr.f90
flwlic.f90
chckit.f90
wave.f90
trab10.f90
compthick.f90
waveu.f90
wri_jet3d.f90
z_sud.f90
wphys.f90
trid2.f90
redvic.f90
f0isf1.f90
dens.f90
c_vvv.f90
wetdis.f90
incdis.f90
brkbed.f90
z_matpro.f90
mirror_bnd.f90
inibnd.f90
chksit.f90
caldpu.f90
regel.f90
noendspaces.f90
endscr.f90
upwhu_dd.f90
tranb4.f90
shearx.f90
calseddf1993.f90
rolcor.f90
discha_nf.f90
z_discha.f90
usrbrl.f90
tabel.f90
mom_cyclic.f90
disbub.f90
cucbp.f90
updbcq.f90
turiwe.f90
C:\delft3d_repository\src\engines_gpl\flow2d3d\packages\kernel\src\taylor\turiwe.f90(267): remark #8291: Recommended relationship between field width 'W' and the number of fractional digits 'D' in this edit descriptor is 'W>=D+7'.
C:\delft3d_repository\src\engines_gpl\flow2d3d\packages\kernel\src\taylor\turiwe.f90(269): remark #8291: Recommended relationship between field width 'W' and the number of fractional digits 'D' in this edit descriptor is 'W>=D+7'.
C:\delft3d_repository\src\engines_gpl\flow2d3d\packages\kernel\src\taylor\turiwe.f90(271): remark #8291: Recommended relationship between field width 'W' and the number of fractional digits 'D' in this edit descriptor is 'W>=D+7'.
bediwe.f90
C:\delft3d_repository\src\engines_gpl\flow2d3d\packages\kernel\src\taylor\bediwe.f90(304): remark #8291: Recommended relationship between field width 'W' and the number of fractional digits 'D' in this edit descriptor is 'W>=D+7'.
C:\delft3d_repository\src\engines_gpl\flow2d3d\packages\kernel\src\taylor\bediwe.f90(306): remark #8291: Recommended relationship between field width 'W' and the number of fractional digits 'D' in this edit descriptor is 'W>=D+7'.
C:\delft3d_repository\src\engines_gpl\flow2d3d\packages\kernel\src\taylor\bediwe.f90(307): remark #8291: Recommended relationship between field width 'W' and the number of fractional digits 'D' in this edit descriptor is 'W>=D+7'.
C:\delft3d_repository\src\engines_gpl\flow2d3d\packages\kernel\src\taylor\bediwe.f90(308): remark #8291: Recommended relationship between field width 'W' and the number of fractional digits 'D' in this edit descriptor is 'W>=D+7'.
C:\delft3d_repository\src\engines_gpl\flow2d3d\packages\kernel\src\taylor\bediwe.f90(310): remark #8291: Recommended relationship between field width 'W' and the number of fractional digits 'D' in this edit descriptor is 'W>=D+7'.
C:\delft3d_repository\src\engines_gpl\flow2d3d\packages\kernel\src\taylor\bediwe.f90(314): remark #8291: Recommended relationship between field width 'W' and the number of fractional digits 'D' in this edit descriptor is 'W>=D+7'.
C:\delft3d_repository\src\engines_gpl\flow2d3d\packages\kernel\src\taylor\bediwe.f90(316): remark #8291: Recommended relationship between field width 'W' and the number of fractional digits 'D' in this edit descriptor is 'W>=D+7'.
C:\delft3d_repository\src\engines_gpl\flow2d3d\packages\kernel\src\taylor\bediwe.f90(320): remark #8291: Recommended relationship between field width 'W' and the number of fractional digits 'D' in this edit descriptor is 'W>=D+7'.
z_hydpres.f90
initem.f90
inchkr.f90
chkiwe.f90
txtstr.f90
read2c.f90
keyinp.f90
defsub.f90
trakad_dd.f90
trabwc.f90
erosed.f90
bedbc1993.f90
massfl.f90
z_uzd_nhfull.f90
z_dengra.f90
ulim.f90
sline.f90
hydkad.f90
dif_ws.f90
cdwkad.f90
Creating library...

Build log written to "file://C:\delft3d_repository\src\engines_gpl\flow2d3d\packages\kernel\Release\BuildLog.txt"
kernel - 0 error(s), 0 warning(s)
------ Build started: Project: esmfsm_version_number, Configuration: Release Win32 ------
Performing Pre-Build Event...
..\..\..\..\scripts_lgpl\win32\make_revision.bat: Regenerating existing file '.\include\version_number.h'.
..\..\..\..\scripts_lgpl\win32\make_revision.bat: executing c:\delft3d_repository\src\third_party_open\subversion\bin\win32\svnversion.exe -n
..\..\..\..\scripts_lgpl\win32\make_revision.bat: 2042
..\..\..\..\scripts_lgpl\win32\make_revision.bat: executing version_number.exe 2042 ".\include\version_number.ini" ".\include\version_number.h.svn" ".\include\version_number.h"
..\..\..\..\scripts_lgpl\win32\make_revision.bat: Regenerating existing file '.\include\version_number.rc'.
..\..\..\..\scripts_lgpl\win32\make_revision.bat: build exists
..\..\..\..\scripts_lgpl\win32\make_revision.bat: 2042
..\..\..\..\scripts_lgpl\win32\make_revision.bat: executing version_number.exe 2042 ".\include\version_number.ini" ".\include\version_number.rc.svn" ".\include\version_number.rc"
Compiling...
c2c.c
version.c
f2c.c
Creating library...
Build log was saved at "file://c:\delft3d_repository\src\utils_lgpl\esmfsm\packages\esmfsm_version_number\Release\BuildLog.htm"
esmfsm_version_number - 0 error(s), 0 warning(s)
------ Build started: Project: stream_version_number, Configuration: Release Win32 ------
Performing Pre-Build Event...
..\..\..\..\scripts_lgpl\win32\make_revision.bat: Regenerating existing file '.\include\version_number.h'.
..\..\..\..\scripts_lgpl\win32\make_revision.bat: executing c:\delft3d_repository\src\third_party_open\subversion\bin\win32\svnversion.exe -n
..\..\..\..\scripts_lgpl\win32\make_revision.bat: 2042
..\..\..\..\scripts_lgpl\win32\make_revision.bat: executing version_number.exe 2042 ".\include\version_number.ini" ".\include\version_number.h.svn" ".\include\version_number.h"
..\..\..\..\scripts_lgpl\win32\make_revision.bat: Regenerating existing file '.\include\version_number.rc'.
..\..\..\..\scripts_lgpl\win32\make_revision.bat: build exists
..\..\..\..\scripts_lgpl\win32\make_revision.bat: 2042
..\..\..\..\scripts_lgpl\win32\make_revision.bat: executing version_number.exe 2042 ".\include\version_number.ini" ".\include\version_number.rc.svn" ".\include\version_number.rc"
Compiling...
c2c.c
version.c
f2c.c
Creating library...
Build log was saved at "file://c:\delft3d_repository\src\utils_lgpl\stream\packages\stream_version_number\Release\BuildLog.htm"
stream_version_number - 0 error(s), 0 warning(s)
------ Build started: Project: esmfsm_c, Configuration: Release Win32 ------
Compiling...
esm.cpp
fsm.cpp
shared.cpp
local.cpp
.\src\esm\local.cpp(196) : warning C4244: 'argument' : conversion from '__int64' to 'size_t', possible loss of data
esm_f.cpp
Creating library...
Build log was saved at "file://c:\delft3d_repository\src\utils_lgpl\esmfsm\packages\esmfsm_c\Release\BuildLog.htm"
esmfsm_c - 0 error(s), 1 warning(s)
------ Build started: Project: data (engines_gpl\wave\data), Configuration: Release Win32 ------
Compiling with Intel(R) Visual Fortran Compiler XE 13.0.1.119 [IA-32]...
filldm.f90
skcoma.f90
datetime_to_string.f90
timdat.f90
skcomc.f90
wave_data.f90
handles.f90
rdsec.f90
sync_flowwave.f90
read_grids.f90
utilities.f90
tables.f90
table_handles.f90
swan_input.f90
C:\delft3d_repository\src\engines_gpl\wave\packages\data\src\swan_input.f90(4539): remark #8290: Recommended relationship between field width 'W' and the number of fractional digits 'D' in this edit descriptor is 'W>=D+3'.
C:\delft3d_repository\src\engines_gpl\wave\packages\data\src\swan_input.f90(4542): remark #8290: Recommended relationship between field width 'W' and the number of fractional digits 'D' in this edit descriptor is 'W>=D+3'.
C:\delft3d_repository\src\engines_gpl\wave\packages\data\src\swan_input.f90(4545): remark #8290: Recommended relationship between field width 'W' and the number of fractional digits 'D' in this edit descriptor is 'W>=D+3'.
C:\delft3d_repository\src\engines_gpl\wave\packages\data\src\swan_input.f90(4557): remark #8290: Recommended relationship between field width 'W' and the number of fractional digits 'D' in this edit descriptor is 'W>=D+3'.
C:\delft3d_repository\src\engines_gpl\wave\packages\data\src\swan_input.f90(4562): remark #8290: Recommended relationship between field width 'W' and the number of fractional digits 'D' in this edit descriptor is 'W>=D+3'.
C:\delft3d_repository\src\engines_gpl\wave\packages\data\src\swan_input.f90(4562): remark #8290: Recommended relationship between field width 'W' and the number of fractional digits 'D' in this edit descriptor is 'W>=D+3'.
C:\delft3d_repository\src\engines_gpl\wave\packages\data\src\swan_input.f90(4605): remark #8290: Recommended relationship between field width 'W' and the number of fractional digits 'D' in this edit descriptor is 'W>=D+3'.
C:\delft3d_repository\src\engines_gpl\wave\packages\data\src\swan_input.f90(4605): remark #8290: Recommended relationship between field width 'W' and the number of fractional digits 'D' in this edit descriptor is 'W>=D+3'.
C:\delft3d_repository\src\engines_gpl\wave\packages\data\src\swan_input.f90(4653): remark #8290: Recommended relationship between field width 'W' and the number of fractional digits 'D' in this edit descriptor is 'W>=D+3'.
swan_flow_grid_maps.f90
flow_data.f90
ipon.f90
indexx.f90
checkmeteoresult_wave.f90
hunt.f90
sort.f90
mkmap.f90
Creating library...

Build log written to "file://C:\delft3d_repository\src\engines_gpl\wave\packages\data\Release\BuildLog.htm"
data - 0 error(s), 0 warning(s)
------ Build started: Project: manager (engines_gpl\flow2d3d\manager), Configuration: Release Win32 ------
Compiling with Intel(R) Visual Fortran Compiler XE 13.0.1.119 [IA-32]...
trisim_mod.F90
tricom_finish.F90
trisim.F90
tdatmain.F90
tripoi.F90
triend.F90
tricom_step.F90
tricom_init.F90
Creating library...

Build log written to "file://C:\delft3d_repository\src\engines_gpl\flow2d3d\packages\manager\Release\BuildLog.txt"
manager - 0 error(s), 0 warning(s)
------ Build started: Project: io (engines_gpl\wave\io), Configuration: Release Win32 ------
Compiling with Intel(R) Visual Fortran Compiler XE 13.0.1.119 [IA-32]...
get_params.f90
readn.f90
cp_file.f90
get_dep.f90
write_swan_datafile.f90
C:\delft3d_repository\src\engines_gpl\wave\packages\io\src\write_swan_datafile.f90(228): remark #8291: Recommended relationship between field width 'W' and the number of fractional digits 'D' in this edit descriptor is 'W>=D+7'.
C:\delft3d_repository\src\engines_gpl\wave\packages\io\src\write_swan_datafile.f90(230): remark #8291: Recommended relationship between field width 'W' and the number of fractional digits 'D' in this edit descriptor is 'W>=D+7'.
C:\delft3d_repository\src\engines_gpl\wave\packages\io\src\write_swan_datafile.f90(234): remark #8291: Recommended relationship between field width 'W' and the number of fractional digits 'D' in this edit descriptor is 'W>=D+7'.
C:\delft3d_repository\src\engines_gpl\wave\packages\io\src\write_swan_datafile.f90(235): remark #8291: Recommended relationship between field width 'W' and the number of fractional digits 'D' in this edit descriptor is 'W>=D+7'.
C:\delft3d_repository\src\engines_gpl\wave\packages\io\src\write_swan_datafile.f90(237): remark #8291: Recommended relationship between field width 'W' and the number of fractional digits 'D' in this edit descriptor is 'W>=D+7'.
C:\delft3d_repository\src\engines_gpl\wave\packages\io\src\write_swan_datafile.f90(238): remark #8291: Recommended relationship between field width 'W' and the number of fractional digits 'D' in this edit descriptor is 'W>=D+7'.
putgtr.f90
wrpara.f90
wavenr.f90
putgtl.f90
flow2wav.f90
putgti.f90
scan_fl.f90
dam_cod.f90
write_wave_map_wind.f90
out2d.f90
get_lev.f90
write_wave_map.f90
read_swan_output.f90
get_wind.f90
write_bnd_loc.f90
get_flow_fields.f90
get_visc.f90
get_cur.f90
get_vegi_map.f90
wrivek.f90
wavcur2d.f90
get_swan_depth.f90
deletehotfile.f90
writek.f90
put_wave_fields.f90
Creating library...

Build log written to "file://C:\delft3d_repository\src\engines_gpl\wave\packages\io\Release\BuildLog.htm"
io - 0 error(s), 0 warning(s)
------ Build started: Project: d_hydro_lib (utils_lgpl\d_hydro_lib\d_hydro_lib), Configuration: Release Win32 ------
Performing Pre-Build Event...
Generating version number in '.\include\d_hydro_lib_version.h' ...
..\..\..\..\scripts_lgpl\win32\update_version.cmd: Regenerating existing file '.\include\d_hydro_lib_version.h'.
Compiling...
clock.cpp
.\src\clock.cpp(122) : warning C4996: 'sprintf': This function or variable may be unsafe. Consider using sprintf_s instead. To disable deprecation, use _CRT_SECURE_NO_WARNINGS. See online help for details.
c:\Program Files (x86)\Microsoft Visual Studio 9.0\VC\include\stdio.h(366) : see declaration of 'sprintf'
xmltree.cpp
.\src\xmltree.cpp(159) : warning C4996: 'strcpy': This function or variable may be unsafe. Consider using strcpy_s instead. To disable deprecation, use _CRT_SECURE_NO_WARNINGS. See online help for details.
c:\Program Files (x86)\Microsoft Visual Studio 9.0\VC\include\string.h(74) : see declaration of 'strcpy'
.\src\xmltree.cpp(162) : warning C4996: 'sprintf': This function or variable may be unsafe. Consider using sprintf_s instead. To disable deprecation, use _CRT_SECURE_NO_WARNINGS. See online help for details.
c:\Program Files (x86)\Microsoft Visual Studio 9.0\VC\include\stdio.h(366) : see declaration of 'sprintf'
.\src\xmltree.cpp(213) : warning C4996: 'strcpy': This function or variable may be unsafe. Consider using strcpy_s instead. To disable deprecation, use _CRT_SECURE_NO_WARNINGS. See online help for details.
c:\Program Files (x86)\Microsoft Visual Studio 9.0\VC\include\string.h(74) : see declaration of 'strcpy'
.\src\xmltree.cpp(214) : warning C4996: 'strcpy': This function or variable may be unsafe. Consider using strcpy_s instead. To disable deprecation, use _CRT_SECURE_NO_WARNINGS. See online help for details.
c:\Program Files (x86)\Microsoft Visual Studio 9.0\VC\include\string.h(74) : see declaration of 'strcpy'
.\src\xmltree.cpp(259) : warning C4996: 'strcpy': This function or variable may be unsafe. Consider using strcpy_s instead. To disable deprecation, use _CRT_SECURE_NO_WARNINGS. See online help for details.
c:\Program Files (x86)\Microsoft Visual Studio 9.0\VC\include\string.h(74) : see declaration of 'strcpy'
.\src\xmltree.cpp(355) : warning C4996: 'sscanf': This function or variable may be unsafe. Consider using sscanf_s instead. To disable deprecation, use _CRT_SECURE_NO_WARNINGS. See online help for details.
c:\Program Files (x86)\Microsoft Visual Studio 9.0\VC\include\stdio.h(324) : see declaration of 'sscanf'
stringutils.cpp
log.cpp
.\src\log.cpp(60) : warning C4996: 'strerror': This function or variable may be unsafe. Consider using strerror_s instead. To disable deprecation, use _CRT_SECURE_NO_WARNINGS. See online help for details.
c:\Program Files (x86)\Microsoft Visual Studio 9.0\VC\include\string.h(126) : see declaration of 'strerror'
.\src\log.cpp(62) : warning C4996: 'strerror': This function or variable may be unsafe. Consider using strerror_s instead. To disable deprecation, use _CRT_SECURE_NO_WARNINGS. See online help for details.
c:\Program Files (x86)\Microsoft Visual Studio 9.0\VC\include\string.h(126) : see declaration of 'strerror'
.\src\log.cpp(103) : warning C4996: 'strerror': This function or variable may be unsafe. Consider using strerror_s instead. To disable deprecation, use _CRT_SECURE_NO_WARNINGS. See online help for details.
c:\Program Files (x86)\Microsoft Visual Studio 9.0\VC\include\string.h(126) : see declaration of 'strerror'
.\src\log.cpp(145) : warning C4996: 'vsnprintf': This function or variable may be unsafe. Consider using vsnprintf_s instead. To disable deprecation, use _CRT_SECURE_NO_WARNINGS. See online help for details.
c:\Program Files (x86)\Microsoft Visual Studio 9.0\VC\include\stdio.h(350) : see declaration of 'vsnprintf'
exception.cpp
.\src\exception.cpp(57) : warning C4996: 'vsnprintf': This function or variable may be unsafe. Consider using vsnprintf_s instead. To disable deprecation, use _CRT_SECURE_NO_WARNINGS. See online help for details.
c:\Program Files (x86)\Microsoft Visual Studio 9.0\VC\include\stdio.h(350) : see declaration of 'vsnprintf'
.\src\exception.cpp(63) : warning C4996: 'strcpy': This function or variable may be unsafe. Consider using strcpy_s instead. To disable deprecation, use _CRT_SECURE_NO_WARNINGS. See online help for details.
c:\Program Files (x86)\Microsoft Visual Studio 9.0\VC\include\string.h(74) : see declaration of 'strcpy'
d_hydro_lib_version.cpp
coredump.cpp
component.cpp
Creating library...
Build log was saved at "file://c:\delft3d_repository\src\utils_lgpl\d_hydro_lib\packages\d_hydro_lib\Release\BuildLog.htm"
d_hydro_lib - 0 error(s), 13 warning(s)
------ Build started: Project: stream (utils_lgpl\stream\stream), Configuration: Release Win32 ------
Compiling...
stream.cpp
.\src\stream.cpp(107) : warning C4244: 'argument' : conversion from 'double' to 'DWORD', possible loss of data
Creating library...
Build log was saved at "file://c:\delft3d_repository\src\utils_lgpl\stream\packages\stream\Release\BuildLog.htm"
stream - 0 error(s), 1 warning(s)
------ Build started: Project: esmfsm (utils_lgpl\esmfsm\esmfsm), Configuration: Release Win32 ------
Compiling with Intel(R) Visual Fortran Compiler XE 13.0.1.119 [IA-32]...
fortapi.f90
Creating library...

Build log written to "file://C:\delft3d_repository\src\utils_lgpl\esmfsm\packages\esmfsm\Release\BuildLog.txt"
esmfsm - 0 error(s), 0 warning(s)
------ Build started: Project: delftonline (utils_lgpl\delftonline\delftonline), Configuration: Release Win32 ------
Performing Pre-Build Event...
Generating version number in '.\delftonline_version.h' ...
..\..\..\..\scripts_lgpl\win32\update_version.cmd: Regenerating existing file '.\delftonline_version.h'.
Compiling...
cl : Command line warning D9035 : option 'Wp64' has been deprecated and will be removed in a future release
util.cpp
c:\delft3d_repository\src\utils_lgpl\delftonline\src\delftonline\dol.h(50) : warning C4005: 'errno' : macro redefinition
c:\Program Files (x86)\Microsoft Visual Studio 9.0\VC\include\errno.h(34) : see previous definition of 'errno'
.\util.cpp(156) : warning C4267: 'initializing' : conversion from 'size_t' to 'int', possible loss of data
.\util.cpp(196) : warning C4267: 'initializing' : conversion from 'size_t' to 'int', possible loss of data
sortedbag.cpp
server.cpp
c:\delft3d_repository\src\utils_lgpl\delftonline\src\delftonline\dol.h(50) : warning C4005: 'errno' : macro redefinition
c:\Program Files (x86)\Microsoft Visual Studio 9.0\VC\include\errno.h(34) : see previous definition of 'errno'
.\server.cpp(127) : warning C4244: '=' : conversion from 'SOCKET' to 'int', possible loss of data
.\server.cpp(262) : warning C4244: '=' : conversion from 'SOCKET' to 'int', possible loss of data
.\server.cpp(318) : warning C4312: 'type cast' : conversion from 'int' to 'void *' of greater size
.\server.cpp(345) : warning C4311: 'type cast' : pointer truncation from 'void *' to 'long'
print.cpp
c:\delft3d_repository\src\utils_lgpl\delftonline\src\delftonline\dol.h(50) : warning C4005: 'errno' : macro redefinition
c:\Program Files (x86)\Microsoft Visual Studio 9.0\VC\include\errno.h(34) : see previous definition of 'errno'
log.cpp
c:\delft3d_repository\src\utils_lgpl\delftonline\src\delftonline\dol.h(50) : warning C4005: 'errno' : macro redefinition
c:\Program Files (x86)\Microsoft Visual Studio 9.0\VC\include\errno.h(34) : see previous definition of 'errno'
linkedlist.cpp
function.cpp
c:\delft3d_repository\src\utils_lgpl\delftonline\src\delftonline\dol.h(50) : warning C4005: 'errno' : macro redefinition
c:\Program Files (x86)\Microsoft Visual Studio 9.0\VC\include\errno.h(34) : see previous definition of 'errno'
.\function.cpp(157) : warning C4312: 'type cast' : conversion from 'int' to 'void *' of greater size
.\function.cpp(260) : warning C4267: 'initializing' : conversion from 'size_t' to 'int', possible loss of data
.\function.cpp(261) : warning C4267: 'initializing' : conversion from 'size_t' to 'int', possible loss of data
.\function.cpp(277) : warning C4267: 'initializing' : conversion from 'size_t' to 'int', possible loss of data
.\function.cpp(278) : warning C4267: 'initializing' : conversion from 'size_t' to 'int', possible loss of data
exception.cpp
c:\delft3d_repository\src\utils_lgpl\delftonline\src\delftonline\dol.h(50) : warning C4005: 'errno' : macro redefinition
c:\Program Files (x86)\Microsoft Visual Studio 9.0\VC\include\errno.h(34) : see previous definition of 'errno'
directory.cpp
c:\delft3d_repository\src\utils_lgpl\delftonline\src\delftonline\dol.h(50) : warning C4005: 'errno' : macro redefinition
c:\Program Files (x86)\Microsoft Visual Studio 9.0\VC\include\errno.h(34) : see previous definition of 'errno'
.\directory.cpp(256) : warning C4267: 'initializing' : conversion from 'size_t' to 'int', possible loss of data
.\directory.cpp(261) : warning C4267: 'initializing' : conversion from 'size_t' to 'int', possible loss of data
.\directory.cpp(266) : warning C4267: 'initializing' : conversion from 'size_t' to 'int', possible loss of data
.\directory.cpp(271) : warning C4267: 'initializing' : conversion from 'size_t' to 'int', possible loss of data
.\directory.cpp(276) : warning C4267: 'initializing' : conversion from 'size_t' to 'int', possible loss of data
.\directory.cpp(296) : warning C4267: 'initializing' : conversion from 'size_t' to 'int', possible loss of data
.\directory.cpp(300) : warning C4267: 'initializing' : conversion from 'size_t' to 'int', possible loss of data
.\directory.cpp(304) : warning C4267: 'initializing' : conversion from 'size_t' to 'int', possible loss of data
.\directory.cpp(308) : warning C4267: 'initializing' : conversion from 'size_t' to 'int', possible loss of data
.\directory.cpp(312) : warning C4267: 'initializing' : conversion from 'size_t' to 'int', possible loss of data
dictionary.cpp
delftonline_version.cpp
dataelement.cpp
c:\delft3d_repository\src\utils_lgpl\delftonline\src\delftonline\dol.h(50) : warning C4005: 'errno' : macro redefinition
c:\Program Files (x86)\Microsoft Visual Studio 9.0\VC\include\errno.h(34) : see previous definition of 'errno'
.\dataelement.cpp(255) : warning C4267: '=' : conversion from 'size_t' to 'unsigned int', possible loss of data
.\dataelement.cpp(255) : warning C4267: '=' : conversion from 'size_t' to 'unsigned int', possible loss of data
.\dataelement.cpp(259) : warning C4267: 'initializing' : conversion from 'size_t' to 'int', possible loss of data
.\dataelement.cpp(260) : warning C4267: 'initializing' : conversion from 'size_t' to 'int', possible loss of data
.\dataelement.cpp(261) : warning C4267: 'initializing' : conversion from 'size_t' to 'int', possible loss of data
.\dataelement.cpp(262) : warning C4267: 'initializing' : conversion from 'size_t' to 'int', possible loss of data
.\dataelement.cpp(292) : warning C4267: 'initializing' : conversion from 'size_t' to 'int', possible loss of data
.\dataelement.cpp(293) : warning C4267: 'initializing' : conversion from 'size_t' to 'int', possible loss of data
.\dataelement.cpp(294) : warning C4267: 'initializing' : conversion from 'size_t' to 'int', possible loss of data
.\dataelement.cpp(295) : warning C4267: 'initializing' : conversion from 'size_t' to 'int', possible loss of data
.\dataelement.cpp(297) : warning C4800: 'char' : forcing value to bool 'true' or 'false' (performance warning)
connection.cpp
c:\delft3d_repository\src\utils_lgpl\delftonline\src\delftonline\dol.h(50) : warning C4005: 'errno' : macro redefinition
c:\Program Files (x86)\Microsoft Visual Studio 9.0\VC\include\errno.h(34) : see previous definition of 'errno'
clock.cpp
c:\delft3d_repository\src\utils_lgpl\delftonline\src\delftonline\dol.h(50) : warning C4005: 'errno' : macro redefinition
c:\Program Files (x86)\Microsoft Visual Studio 9.0\VC\include\errno.h(34) : see previous definition of 'errno'
client.cpp
c:\delft3d_repository\src\utils_lgpl\delftonline\src\delftonline\dol.h(50) : warning C4005: 'errno' : macro redefinition
c:\Program Files (x86)\Microsoft Visual Studio 9.0\VC\include\errno.h(34) : see previous definition of 'errno'
.\client.cpp(118) : warning C4244: '=' : conversion from 'SOCKET' to 'int', possible loss of data
.\client.cpp(389) : warning C4800: 'int' : forcing value to bool 'true' or 'false' (performance warning)
.\client.cpp(520) : warning C4800: 'int' : forcing value to bool 'true' or 'false' (performance warning)
.\client.cpp(559) : warning C4800: 'int' : forcing value to bool 'true' or 'false' (performance warning)
barrier.cpp
c:\delft3d_repository\src\utils_lgpl\delftonline\src\delftonline\dol.h(50) : warning C4005: 'errno' : macro redefinition
c:\Program Files (x86)\Microsoft Visual Studio 9.0\VC\include\errno.h(34) : see previous definition of 'errno'
arrayshape.cpp
c:\delft3d_repository\src\utils_lgpl\delftonline\src\delftonline\dol.h(50) : warning C4005: 'errno' : macro redefinition
c:\Program Files (x86)\Microsoft Visual Studio 9.0\VC\include\errno.h(34) : see previous definition of 'errno'
.\arrayshape.cpp(220) : warning C4267: 'initializing' : conversion from 'size_t' to 'int', possible loss of data
.\arrayshape.cpp(240) : warning C4267: 'initializing' : conversion from 'size_t' to 'int', possible loss of data
Linking...
Creating library ../../lib/Release/dynamic\delftonline.lib and object ../../lib/Release/dynamic\delftonline.exp
Generating code
Finished generating code
Embedding manifest...
Build log was saved at "file://c:\delft3d_repository\src\utils_lgpl\delftonline\src\delftonline\Release\BuildLog.htm"
delftonline - 0 error(s), 52 warning(s)
------ Build started: Project: plugin_3dmortrafrm_c, Configuration: Release Win32 ------
Compiling...
f902c.c
Creating library...
Build log was saved at "file://c:\delft3d_repository\src\engines_gpl\flow2d3d\packages\plugin_3dmortrafrm_c\Release\BuildLog.htm"
plugin_3dmortrafrm_c - 0 error(s), 0 warning(s)
------ Build started: Project: kernel (engines_gpl\wave\kernel), Configuration: Release Win32 ------
Compiling with Intel(R) Visual Fortran Compiler XE 13.0.1.119 [IA-32]...
small.f90
corrht.f90
grmap.f90
C:\delft3d_repository\src\engines_gpl\wave\packages\kernel\src\grmap.f90(80): remark #8291: Recommended relationship between field width 'W' and the number of fractional digits 'D' in this edit descriptor is 'W>=D+7'.
rm_del.f90
wapar.f90
fxfydr.f90
perpar.f90
dircor.f90
new_lun.f90
update_wavecond.f90
del_temp_files.f90
wave_init.f90
map_swan_output.f90
wave2flow.f90
check_input.f90
run_swan.f90
wave2com.f90
grids_and_gridmaps.f90
Creating library...

Build log written to "file://C:\delft3d_repository\src\engines_gpl\wave\packages\kernel\Release\BuildLog.htm"
kernel - 0 error(s), 0 warning(s)
------ Build started: Project: flow2d3d_openda_lib, Configuration: Release Win32 ------
Compiling with Intel(R) Visual Fortran Compiler XE 13.0.1.119 [IA-32]...
m_d3d_state.f90
m_d3dstate_2_openda.f90
d3dstate_2_d3d.f90
localization.f90
flow2d3d_openda_dll.f90
flow2d3d_openda.f90
flow2d3d_f.f90
Creating library...

Build log written to "file://C:\delft3d_repository\src\engines_gpl\flow2d3d\packages\flow2d3d_openda\Release\BuildLog.txt"
flow2d3d_openda_lib - 0 error(s), 0 warning(s)
------ Build started: Project: flow2d3d (engines_gpl\flow2d3d\flow2d3d), Configuration: Release Win32 ------
Performing Pre-Build Event...
Generating version number in '.\include\flow2d3d_version.h' ...
..\..\..\..\scripts_lgpl\win32\update_version.cmd: Regenerating existing file '.\include\flow2d3d_version.h'.
Compiling...
varinfocoll.cpp
mapper_uvz.cpp
mapper_statemachine.cpp
mapper_general.cpp
.\src\dd\mapper\mapper_general.cpp(104) : warning C4996: 'strcpy': This function or variable may be unsafe. Consider using strcpy_s instead. To disable deprecation, use _CRT_SECURE_NO_WARNINGS. See online help for details.
c:\Program Files (x86)\Microsoft Visual Studio 9.0\VC\include\string.h(74) : see declaration of 'strcpy'
.\src\dd\mapper\mapper_general.cpp(438) : warning C4996: 'sprintf': This function or variable may be unsafe. Consider using sprintf_s instead. To disable deprecation, use _CRT_SECURE_NO_WARNINGS. See online help for details.
c:\Program Files (x86)\Microsoft Visual Studio 9.0\VC\include\stdio.h(366) : see declaration of 'sprintf'
.\src\dd\mapper\mapper_general.cpp(439) : warning C4996: 'fopen': This function or variable may be unsafe. Consider using fopen_s instead. To disable deprecation, use _CRT_SECURE_NO_WARNINGS. See online help for details.
c:\Program Files (x86)\Microsoft Visual Studio 9.0\VC\include\stdio.h(237) : see declaration of 'fopen'
mapper_config.cpp
.\src\dd\mapper\mapper_config.cpp(72) : warning C4996: 'sscanf': This function or variable may be unsafe. Consider using sscanf_s instead. To disable deprecation, use _CRT_SECURE_NO_WARNINGS. See online help for details.
c:\Program Files (x86)\Microsoft Visual Studio 9.0\VC\include\stdio.h(324) : see declaration of 'sscanf'
.\src\dd\mapper\mapper_config.cpp(165) : warning C4996: 'fopen': This function or variable may be unsafe. Consider using fopen_s instead. To disable deprecation, use _CRT_SECURE_NO_WARNINGS. See online help for details.
c:\Program Files (x86)\Microsoft Visual Studio 9.0\VC\include\stdio.h(237) : see declaration of 'fopen'
map_messages.cpp
map_debug.cpp
.\src\dd\mapper\map_debug.cpp(113) : warning C4996: 'fopen': This function or variable may be unsafe. Consider using fopen_s instead. To disable deprecation, use _CRT_SECURE_NO_WARNINGS. See online help for details.
c:\Program Files (x86)\Microsoft Visual Studio 9.0\VC\include\stdio.h(237) : see declaration of 'fopen'
hymapper.cpp
gaws_wang_eq.cpp
gaws.cpp
.\src\dd\mapper\gaws.cpp(1049) : warning C4996: 'sprintf': This function or variable may be unsafe. Consider using sprintf_s instead. To disable deprecation, use _CRT_SECURE_NO_WARNINGS. See online help for details.
c:\Program Files (x86)\Microsoft Visual Studio 9.0\VC\include\stdio.h(366) : see declaration of 'sprintf'
.\src\dd\mapper\gaws.cpp(1050) : warning C4996: 'fopen': This function or variable may be unsafe. Consider using fopen_s instead. To disable deprecation, use _CRT_SECURE_NO_WARNINGS. See online help for details.
c:\Program Files (x86)\Microsoft Visual Studio 9.0\VC\include\stdio.h(237) : see declaration of 'fopen'
.\src\dd\mapper\gaws.cpp(1751) : warning C4996: 'strcpy': This function or variable may be unsafe. Consider using strcpy_s instead. To disable deprecation, use _CRT_SECURE_NO_WARNINGS. See online help for details.
c:\Program Files (x86)\Microsoft Visual Studio 9.0\VC\include\string.h(74) : see declaration of 'strcpy'
flow_nxtstp.cpp
.\src\dd\mapper\flow_nxtstp.cpp(255) : warning C4297: 'GWSSLV' : function assumed not to throw an exception but does
__declspec(nothrow) or throw() was specified on the function
.\src\dd\mapper\flow_nxtstp.cpp(323) : warning C4297: 'GWSSLV' : function assumed not to throw an exception but does
__declspec(nothrow) or throw() was specified on the function
.\src\dd\mapper\flow_nxtstp.cpp(420) : warning C4297: 'COMMUNICATENEXTSTEPWITHMAPPER' : function assumed not to throw an exception but does
__declspec(nothrow) or throw() was specified on the function
.\src\dd\mapper\flow_nxtstp.cpp(513) : warning C4297: 'COMMUNICATENEXTSTEPWITHMAPPER' : function assumed not to throw an exception but does
__declspec(nothrow) or throw() was specified on the function
.\src\dd\mapper\flow_nxtstp.cpp(558) : warning C4297: 'COMMUNICATENEXTSTEPWITHMAPPER' : function assumed not to throw an exception but does
__declspec(nothrow) or throw() was specified on the function
.\src\dd\mapper\flow_nxtstp.cpp(659) : warning C4996: 'strncpy': This function or variable may be unsafe. Consider using strncpy_s instead. To disable deprecation, use _CRT_SECURE_NO_WARNINGS. See online help for details.
c:\Program Files (x86)\Microsoft Visual Studio 9.0\VC\include\string.h(157) : see declaration of 'strncpy'
context_general_functs.cpp
.\src\dd\mapper\context_general_functs.cpp(569) : warning C4996: 'sprintf': This function or variable may be unsafe. Consider using sprintf_s instead. To disable deprecation, use _CRT_SECURE_NO_WARNINGS. See online help for details.
c:\Program Files (x86)\Microsoft Visual Studio 9.0\VC\include\stdio.h(366) : see declaration of 'sprintf'
.\src\dd\mapper\context_general_functs.cpp(570) : warning C4996: 'fopen': This function or variable may be unsafe. Consider using fopen_s instead. To disable deprecation, use _CRT_SECURE_NO_WARNINGS. See online help for details.
c:\Program Files (x86)\Microsoft Visual Studio 9.0\VC\include\stdio.h(237) : see declaration of 'fopen'
context_distrib_functs.cpp
context-mapside.cpp
context-gawsside.cpp
context-flowside.cpp
rtcComm.cpp
.\src\dd\iterators\rtcComm.cpp(175) : warning C4018: '<' : signed/unsigned mismatch
.\src\dd\iterators\rtcComm.cpp(183) : warning C4018: '<' : signed/unsigned mismatch
.\src\dd\iterators\rtcComm.cpp(189) : warning C4018: '<' : signed/unsigned mismatch
.\src\dd\iterators\rtcComm.cpp(206) : warning C4018: '<' : signed/unsigned mismatch
.\src\dd\iterators\rtcComm.cpp(214) : warning C4018: '<' : signed/unsigned mismatch
.\src\dd\iterators\rtcComm.cpp(221) : warning C4018: '<' : signed/unsigned mismatch
.\src\dd\iterators\rtcComm.cpp(251) : warning C4297: 'RTCSTARTCOMMUNICATION' : function assumed not to throw an exception but does
The function is extern "C" and /EHc was specified
.\src\dd\iterators\rtcComm.cpp(255) : warning C4297: 'RTCSTARTCOMMUNICATION' : function assumed not to throw an exception but does
The function is extern "C" and /EHc was specified
.\src\dd\iterators\rtcComm.cpp(274) : warning C4297: 'RTCSTARTCOMMUNICATION' : function assumed not to throw an exception but does
The function is extern "C" and /EHc was specified
.\src\dd\iterators\rtcComm.cpp(300) : warning C4297: 'RTCCOMMUNICATE' : function assumed not to throw an exception but does
The function is extern "C" and /EHc was specified
.\src\dd\iterators\rtcComm.cpp(304) : warning C4297: 'RTCCOMMUNICATE' : function assumed not to throw an exception but does
The function is extern "C" and /EHc was specified
.\src\dd\iterators\rtcComm.cpp(333) : warning C4297: 'RTCCOMMUNICATE' : function assumed not to throw an exception but does
The function is extern "C" and /EHc was specified
.\src\dd\iterators\rtcComm.cpp(358) : warning C4297: 'RTCCHARCOMMUNICATE' : function assumed not to throw an exception but does
The function is extern "C" and /EHc was specified
.\src\dd\iterators\rtcComm.cpp(362) : warning C4297: 'RTCCHARCOMMUNICATE' : function assumed not to throw an exception but does
The function is extern "C" and /EHc was specified
.\src\dd\iterators\rtcComm.cpp(390) : warning C4297: 'RTCCHARCOMMUNICATE' : function assumed not to throw an exception but does
The function is extern "C" and /EHc was specified
minimumBarrier.cpp
initBarrier.cpp
.\src\dd\iterators\initBarrier.cpp(115) : warning C4297: 'INITFINISHED' : function assumed not to throw an exception but does
The function is extern "C" and /EHc was specified
.\src\dd\iterators\initBarrier.cpp(131) : warning C4297: 'INITFINISHED' : function assumed not to throw an exception but does
The function is extern "C" and /EHc was specified
gawsBarrier.cpp
Compiling...
dredgeMerge.cpp
.\src\dd\iterators\dredgeMerge.cpp(164) : warning C4018: '<' : signed/unsigned mismatch
.\src\dd\iterators\dredgeMerge.cpp(172) : warning C4018: '<' : signed/unsigned mismatch
.\src\dd\iterators\dredgeMerge.cpp(178) : warning C4018: '<' : signed/unsigned mismatch
.\src\dd\iterators\dredgeMerge.cpp(210) : warning C4297: 'DREDGESTARTCOMMUNICATE' : function assumed not to throw an exception but does
The function is extern "C" and /EHc was specified
.\src\dd\iterators\dredgeMerge.cpp(214) : warning C4297: 'DREDGESTARTCOMMUNICATE' : function assumed not to throw an exception but does
The function is extern "C" and /EHc was specified
.\src\dd\iterators\dredgeMerge.cpp(231) : warning C4297: 'DREDGESTARTCOMMUNICATE' : function assumed not to throw an exception but does
The function is extern "C" and /EHc was specified
.\src\dd\iterators\dredgeMerge.cpp(259) : warning C4297: 'DREDGECOMMUNICATE' : function assumed not to throw an exception but does
The function is extern "C" and /EHc was specified
.\src\dd\iterators\dredgeMerge.cpp(263) : warning C4297: 'DREDGECOMMUNICATE' : function assumed not to throw an exception but does
The function is extern "C" and /EHc was specified
.\src\dd\iterators\dredgeMerge.cpp(290) : warning C4297: 'DREDGECOMMUNICATE' : function assumed not to throw an exception but does
The function is extern "C" and /EHc was specified
threads.cpp
.\src\dd\threads.cpp(51) : warning C4996: 'strerror': This function or variable may be unsafe. Consider using strerror_s instead. To disable deprecation, use _CRT_SECURE_NO_WARNINGS. See online help for details.
c:\Program Files (x86)\Microsoft Visual Studio 9.0\VC\include\string.h(126) : see declaration of 'strerror'
.\src\dd\threads.cpp(53) : warning C4996: 'strerror': This function or variable may be unsafe. Consider using strerror_s instead. To disable deprecation, use _CRT_SECURE_NO_WARNINGS. See online help for details.
c:\Program Files (x86)\Microsoft Visual Studio 9.0\VC\include\string.h(126) : see declaration of 'strerror'
.\src\dd\threads.cpp(58) : warning C4996: 'strerror': This function or variable may be unsafe. Consider using strerror_s instead. To disable deprecation, use _CRT_SECURE_NO_WARNINGS. See online help for details.
c:\Program Files (x86)\Microsoft Visual Studio 9.0\VC\include\string.h(126) : see declaration of 'strerror'
.\src\dd\threads.cpp(63) : warning C4996: 'strerror': This function or variable may be unsafe. Consider using strerror_s instead. To disable deprecation, use _CRT_SECURE_NO_WARNINGS. See online help for details.
c:\Program Files (x86)\Microsoft Visual Studio 9.0\VC\include\string.h(126) : see declaration of 'strerror'
.\src\dd\threads.cpp(69) : warning C4996: 'strerror': This function or variable may be unsafe. Consider using strerror_s instead. To disable deprecation, use _CRT_SECURE_NO_WARNINGS. See online help for details.
c:\Program Files (x86)\Microsoft Visual Studio 9.0\VC\include\string.h(126) : see declaration of 'strerror'
.\src\dd\threads.cpp(78) : warning C4996: 'strerror': This function or variable may be unsafe. Consider using strerror_s instead. To disable deprecation, use _CRT_SECURE_NO_WARNINGS. See online help for details.
c:\Program Files (x86)\Microsoft Visual Studio 9.0\VC\include\string.h(126) : see declaration of 'strerror'
.\src\dd\threads.cpp(82) : warning C4996: 'strerror': This function or variable may be unsafe. Consider using strerror_s instead. To disable deprecation, use _CRT_SECURE_NO_WARNINGS. See online help for details.
c:\Program Files (x86)\Microsoft Visual Studio 9.0\VC\include\string.h(126) : see declaration of 'strerror'
.\src\dd\threads.cpp(103) : warning C4996: 'strerror': This function or variable may be unsafe. Consider using strerror_s instead. To disable deprecation, use _CRT_SECURE_NO_WARNINGS. See online help for details.
c:\Program Files (x86)\Microsoft Visual Studio 9.0\VC\include\string.h(126) : see declaration of 'strerror'
semaphore.cpp
.\src\dd\semaphore.cpp(58) : warning C4996: 'strcpy': This function or variable may be unsafe. Consider using strcpy_s instead. To disable deprecation, use _CRT_SECURE_NO_WARNINGS. See online help for details.
c:\Program Files (x86)\Microsoft Visual Studio 9.0\VC\include\string.h(74) : see declaration of 'strcpy'
node.cpp
.\src\dd\node.cpp(127) : warning C4996: 'fopen': This function or variable may be unsafe. Consider using fopen_s instead. To disable deprecation, use _CRT_SECURE_NO_WARNINGS. See online help for details.
c:\Program Files (x86)\Microsoft Visual Studio 9.0\VC\include\stdio.h(237) : see declaration of 'fopen'
.\src\dd\node.cpp(129) : warning C4996: 'strerror': This function or variable may be unsafe. Consider using strerror_s instead. To disable deprecation, use _CRT_SECURE_NO_WARNINGS. See online help for details.
c:\Program Files (x86)\Microsoft Visual Studio 9.0\VC\include\string.h(126) : see declaration of 'strerror'
list.cpp
iterator.cpp
.\src\dd\iterator.cpp(80) : warning C4996: 'strcpy': This function or variable may be unsafe. Consider using strcpy_s instead. To disable deprecation, use _CRT_SECURE_NO_WARNINGS. See online help for details.
c:\Program Files (x86)\Microsoft Visual Studio 9.0\VC\include\string.h(74) : see declaration of 'strcpy'
.\src\dd\iterator.cpp(106) : warning C4996: 'strcpy': This function or variable may be unsafe. Consider using strcpy_s instead. To disable deprecation, use _CRT_SECURE_NO_WARNINGS. See online help for details.
c:\Program Files (x86)\Microsoft Visual Studio 9.0\VC\include\string.h(74) : see declaration of 'strcpy'
.\src\dd\iterator.cpp(499) : warning C4996: 'sprintf': This function or variable may be unsafe. Consider using sprintf_s instead. To disable deprecation, use _CRT_SECURE_NO_WARNINGS. See online help for details.
c:\Program Files (x86)\Microsoft Visual Studio 9.0\VC\include\stdio.h(366) : see declaration of 'sprintf'
distributed.cpp
.\src\dd\distributed.cpp(563) : warning C4554: '&' : check operator precedence for possible error; use parentheses to clarify precedence
dictionary.cpp
.\src\dd\dictionary.cpp(83) : warning C4996: 'strcpy': This function or variable may be unsafe. Consider using strcpy_s instead. To disable deprecation, use _CRT_SECURE_NO_WARNINGS. See online help for details.
c:\Program Files (x86)\Microsoft Visual Studio 9.0\VC\include\string.h(74) : see declaration of 'strcpy'
dd.cpp
.\src\dd\dd.cpp(288) : warning C4996: 'fopen': This function or variable may be unsafe. Consider using fopen_s instead. To disable deprecation, use _CRT_SECURE_NO_WARNINGS. See online help for details.
c:\Program Files (x86)\Microsoft Visual Studio 9.0\VC\include\stdio.h(237) : see declaration of 'fopen'
.\src\dd\dd.cpp(346) : warning C4996: 'sscanf': This function or variable may be unsafe. Consider using sscanf_s instead. To disable deprecation, use _CRT_SECURE_NO_WARNINGS. See online help for details.
c:\Program Files (x86)\Microsoft Visual Studio 9.0\VC\include\stdio.h(324) : see declaration of 'sscanf'
.\src\dd\dd.cpp(353) : warning C4996: 'sscanf': This function or variable may be unsafe. Consider using sscanf_s instead. To disable deprecation, use _CRT_SECURE_NO_WARNINGS. See online help for details.
c:\Program Files (x86)\Microsoft Visual Studio 9.0\VC\include\stdio.h(324) : see declaration of 'sscanf'
.\src\dd\dd.cpp(363) : warning C4996: 'sprintf': This function or variable may be unsafe. Consider using sprintf_s instead. To disable deprecation, use _CRT_SECURE_NO_WARNINGS. See online help for details.
c:\Program Files (x86)\Microsoft Visual Studio 9.0\VC\include\stdio.h(366) : see declaration of 'sprintf'
.\src\dd\dd.cpp(426) : warning C4996: 'strcpy': This function or variable may be unsafe. Consider using strcpy_s instead. To disable deprecation, use _CRT_SECURE_NO_WARNINGS. See online help for details.
c:\Program Files (x86)\Microsoft Visual Studio 9.0\VC\include\string.h(74) : see declaration of 'strcpy'
.\src\dd\dd.cpp(502) : warning C4996: 'sprintf': This function or variable may be unsafe. Consider using sprintf_s instead. To disable deprecation, use _CRT_SECURE_NO_WARNINGS. See online help for details.
c:\Program Files (x86)\Microsoft Visual Studio 9.0\VC\include\stdio.h(366) : see declaration of 'sprintf'
.\src\dd\dd.cpp(557) : warning C4996: 'strncpy': This function or variable may be unsafe. Consider using strncpy_s instead. To disable deprecation, use _CRT_SECURE_NO_WARNINGS. See online help for details.
c:\Program Files (x86)\Microsoft Visual Studio 9.0\VC\include\string.h(157) : see declaration of 'strncpy'
.\src\dd\dd.cpp(572) : warning C4996: 'open': The POSIX name for this item is deprecated. Instead, use the ISO C++ conformant name: _open. See online help for details.
c:\Program Files (x86)\Microsoft Visual Studio 9.0\VC\include\io.h(316) : see declaration of 'open'
.\src\dd\dd.cpp(576) : warning C4996: 'close': The POSIX name for this item is deprecated. Instead, use the ISO C++ conformant name: _close. See online help for details.
c:\Program Files (x86)\Microsoft Visual Studio 9.0\VC\include\io.h(306) : see declaration of 'close'
.\src\dd\dd.cpp(580) : warning C4996: 'close': The POSIX name for this item is deprecated. Instead, use the ISO C++ conformant name: _close. See online help for details.
c:\Program Files (x86)\Microsoft Visual Studio 9.0\VC\include\io.h(306) : see declaration of 'close'
.\src\dd\dd.cpp(620) : warning C4996: 'strcpy': This function or variable may be unsafe. Consider using strcpy_s instead. To disable deprecation, use _CRT_SECURE_NO_WARNINGS. See online help for details.
c:\Program Files (x86)\Microsoft Visual Studio 9.0\VC\include\string.h(74) : see declaration of 'strcpy'
.\src\dd\dd.cpp(622) : warning C4996: 'strcpy': This function or variable may be unsafe. Consider using strcpy_s instead. To disable deprecation, use _CRT_SECURE_NO_WARNINGS. See online help for details.
c:\Program Files (x86)\Microsoft Visual Studio 9.0\VC\include\string.h(74) : see declaration of 'strcpy'
.\src\dd\dd.cpp(624) : warning C4996: 'strncpy': This function or variable may be unsafe. Consider using strncpy_s instead. To disable deprecation, use _CRT_SECURE_NO_WARNINGS. See online help for details.
c:\Program Files (x86)\Microsoft Visual Studio 9.0\VC\include\string.h(157) : see declaration of 'strncpy'
.\src\dd\dd.cpp(655) : warning C4996: 'sprintf': This function or variable may be unsafe. Consider using sprintf_s instead. To disable deprecation, use _CRT_SECURE_NO_WARNINGS. See online help for details.
c:\Program Files (x86)\Microsoft Visual Studio 9.0\VC\include\stdio.h(366) : see declaration of 'sprintf'
.\src\dd\dd.cpp(665) : warning C4996: 'sprintf': This function or variable may be unsafe. Consider using sprintf_s instead. To disable deprecation, use _CRT_SECURE_NO_WARNINGS. See online help for details.
c:\Program Files (x86)\Microsoft Visual Studio 9.0\VC\include\stdio.h(366) : see declaration of 'sprintf'
.\src\dd\dd.cpp(783) : warning C4996: 'sprintf': This function or variable may be unsafe. Consider using sprintf_s instead. To disable deprecation, use _CRT_SECURE_NO_WARNINGS. See online help for details.
c:\Program Files (x86)\Microsoft Visual Studio 9.0\VC\include\stdio.h(366) : see declaration of 'sprintf'
category.cpp
.\src\dd\category.cpp(66) : warning C4996: 'strcpy': This function or variable may be unsafe. Consider using strcpy_s instead. To disable deprecation, use _CRT_SECURE_NO_WARNINGS. See online help for details.
c:\Program Files (x86)\Microsoft Visual Studio 9.0\VC\include\string.h(74) : see declaration of 'strcpy'
.\src\dd\category.cpp(69) : warning C4996: 'strcpy': This function or variable may be unsafe. Consider using strcpy_s instead. To disable deprecation, use _CRT_SECURE_NO_WARNINGS. See online help for details.
c:\Program Files (x86)\Microsoft Visual Studio 9.0\VC\include\string.h(74) : see declaration of 'strcpy'
blob.cpp
readxmldd.cpp
flowol.cpp
.\src\flowol.cpp(92) : warning C4996: 'sscanf': This function or variable may be unsafe. Consider using sscanf_s instead. To disable deprecation, use _CRT_SECURE_NO_WARNINGS. See online help for details.
c:\Program Files (x86)\Microsoft Visual Studio 9.0\VC\include\stdio.h(324) : see declaration of 'sscanf'
.\src\flowol.cpp(112) : warning C4996: 'fopen': This function or variable may be unsafe. Consider using fopen_s instead. To disable deprecation, use _CRT_SECURE_NO_WARNINGS. See online help for details.
c:\Program Files (x86)\Microsoft Visual Studio 9.0\VC\include\stdio.h(237) : see declaration of 'fopen'
.\src\flowol.cpp(114) : warning C4996: 'strerror': This function or variable may be unsafe. Consider using strerror_s instead. To disable deprecation, use _CRT_SECURE_NO_WARNINGS. See online help for details.
c:\Program Files (x86)\Microsoft Visual Studio 9.0\VC\include\string.h(126) : see declaration of 'strerror'
.\src\flowol.cpp(242) : warning C4297: 'FLOWOL_ARRAYSHAPE' : function assumed not to throw an exception but does
The function is extern "C" and /EHc was specified
.\src\flowol.cpp(268) : warning C4297: 'FLOWOL_CHANGEDIRECTORY' : function assumed not to throw an exception but does
The function is extern "C" and /EHc was specified
.\src\flowol.cpp(326) : warning C4297: 'FLOWOL_PUBLISH_C' : function assumed not to throw an exception but does
The function is extern "C" and /EHc was specified
.\src\flowol.cpp(420) : warning C4297: 'FLOWOL_PUBLISHFUNCTION' : function assumed not to throw an exception but does
The function is extern "C" and /EHc was specified
.\src\flowol.cpp(453) : warning C4996: 'sprintf': This function or variable may be unsafe. Consider using sprintf_s instead. To disable deprecation, use _CRT_SECURE_NO_WARNINGS. See online help for details.
c:\Program Files (x86)\Microsoft Visual Studio 9.0\VC\include\stdio.h(366) : see declaration of 'sprintf'
.\src\flowol.cpp(463) : warning C4297: 'FLOWOL_SETDESCRIPTION' : function assumed not to throw an exception but does
The function is extern "C" and /EHc was specified
.\src\flowol.cpp(486) : warning C4297: 'FLOWOL_TIMESTEP' : function assumed not to throw an exception but does
The function is extern "C" and /EHc was specified
.\src\flowol.cpp(514) : warning C4297: 'FLOWOL_RETRACT' : function assumed not to throw an exception but does
The function is extern "C" and /EHc was specified
.\src\flowol.cpp(540) : warning C4297: 'FLOWOL_RETRACTARRAYSHAPE' : function assumed not to throw an exception but does
The function is extern "C" and /EHc was specified
.\src\flowol.cpp(566) : warning C4297: 'FLOWOL_RETRACTFUNCTION' : function assumed not to throw an exception but does
The function is extern "C" and /EHc was specified
flow2d3d_version.cpp
.\src\flow2d3d_version.cpp(57) : warning C4996: 'strncpy': This function or variable may be unsafe. Consider using strncpy_s instead. To disable deprecation, use _CRT_SECURE_NO_WARNINGS. See online help for details.
c:\Program Files (x86)\Microsoft Visual Studio 9.0\VC\include\string.h(157) : see declaration of 'strncpy'
.\src\flow2d3d_version.cpp(65) : warning C4996: 'strncpy': This function or variable may be unsafe. Consider using strncpy_s instead. To disable deprecation, use _CRT_SECURE_NO_WARNINGS. See online help for details.
c:\Program Files (x86)\Microsoft Visual Studio 9.0\VC\include\string.h(157) : see declaration of 'strncpy'
.\src\flow2d3d_version.cpp(73) : warning C4996: 'strncpy': This function or variable may be unsafe. Consider using strncpy_s instead. To disable deprecation, use _CRT_SECURE_NO_WARNINGS. See online help for details.
c:\Program Files (x86)\Microsoft Visual Studio 9.0\VC\include\string.h(157) : see declaration of 'strncpy'
.\src\flow2d3d_version.cpp(81) : warning C4996: 'strncpy': This function or variable may be unsafe. Consider using strncpy_s instead. To disable deprecation, use _CRT_SECURE_NO_WARNINGS. See online help for details.
c:\Program Files (x86)\Microsoft Visual Studio 9.0\VC\include\string.h(157) : see declaration of 'strncpy'
.\src\flow2d3d_version.cpp(89) : warning C4996: 'strncpy': This function or variable may be unsafe. Consider using strncpy_s instead. To disable deprecation, use _CRT_SECURE_NO_WARNINGS. See online help for details.
c:\Program Files (x86)\Microsoft Visual Studio 9.0\VC\include\string.h(157) : see declaration of 'strncpy'
.\src\flow2d3d_version.cpp(97) : warning C4996: 'strncpy': This function or variable may be unsafe. Consider using strncpy_s instead. To disable deprecation, use _CRT_SECURE_NO_WARNINGS. See online help for details.
c:\Program Files (x86)\Microsoft Visual Studio 9.0\VC\include\string.h(157) : see declaration of 'strncpy'
flow2d3d.cpp
.\src\flow2d3d.cpp(200) : warning C4996: 'fopen': This function or variable may be unsafe. Consider using fopen_s instead. To disable deprecation, use _CRT_SECURE_NO_WARNINGS. See online help for details.
c:\Program Files (x86)\Microsoft Visual Studio 9.0\VC\include\stdio.h(237) : see declaration of 'fopen'
Linking...
LINK : fatal error LNK1104: cannot open file 'ifmodintr.lib'
Build log was saved at "file://c:\delft3d_repository\src\engines_gpl\flow2d3d\packages\flow2d3d\Release\BuildLog.htm"
flow2d3d - 1 error(s), 97 warning(s)
------ Build started: Project: datsel_version_number, Configuration: Release Win32 ------
Performing Pre-Build Event...
..\..\..\..\scripts_lgpl\win32\make_revision.bat: Regenerating existing file '.\include\version_number.h'.
..\..\..\..\scripts_lgpl\win32\make_revision.bat: executing c:\delft3d_repository\src\third_party_open\subversion\bin\win32\svnversion.exe -n
..\..\..\..\scripts_lgpl\win32\make_revision.bat: 2042M
..\..\..\..\scripts_lgpl\win32\make_revision.bat: executing version_number.exe 2042M ".\include\version_number.ini" ".\include\version_number.h.svn" ".\include\version_number.h"
..\..\..\..\scripts_lgpl\win32\make_revision.bat: Regenerating existing file '.\include\version_number.rc'.
..\..\..\..\scripts_lgpl\win32\make_revision.bat: build exists
..\..\..\..\scripts_lgpl\win32\make_revision.bat: 2042M
..\..\..\..\scripts_lgpl\win32\make_revision.bat: executing version_number.exe 2042M ".\include\version_number.ini" ".\include\version_number.rc.svn" ".\include\version_number.rc"
Compiling...
c2c.c
version.c
f2c.c
Creating library...
Performing Post-Build Event...
Build log was saved at "file://c:\delft3d_repository\src\tools_gpl\datsel\packages\datsel_version_number\Release\BuildLog.htm"
datsel_version_number - 0 error(s), 0 warning(s)
------ Build started: Project: flow2d3d_openda, Configuration: Release Win32 ------
Performing Pre-Build Event...
Generating version number in '..\flow2d3d\include\flow2d3d_version.h' ...
..\..\..\..\scripts_lgpl\win32\update_version.cmd: Regenerating existing file '..\flow2d3d\include\flow2d3d_version.h'.
Generating version number in '.\include\flow2d3d_openda_version.h' ...
..\..\..\..\scripts_lgpl\win32\update_version.cmd: Regenerating existing file '.\include\flow2d3d_openda_version.h'.
Compiling...
varinfocoll.cpp
mapper_uvz.cpp
mapper_statemachine.cpp
mapper_general.cpp
..\flow2d3d\src\dd\mapper\mapper_general.cpp(104) : warning C4996: 'strcpy': This function or variable may be unsafe. Consider using strcpy_s instead. To disable deprecation, use _CRT_SECURE_NO_WARNINGS. See online help for details.
c:\Program Files (x86)\Microsoft Visual Studio 9.0\VC\include\string.h(74) : see declaration of 'strcpy'
..\flow2d3d\src\dd\mapper\mapper_general.cpp(438) : warning C4996: 'sprintf': This function or variable may be unsafe. Consider using sprintf_s instead. To disable deprecation, use _CRT_SECURE_NO_WARNINGS. See online help for details.
c:\Program Files (x86)\Microsoft Visual Studio 9.0\VC\include\stdio.h(366) : see declaration of 'sprintf'
..\flow2d3d\src\dd\mapper\mapper_general.cpp(439) : warning C4996: 'fopen': This function or variable may be unsafe. Consider using fopen_s instead. To disable deprecation, use _CRT_SECURE_NO_WARNINGS. See online help for details.
c:\Program Files (x86)\Microsoft Visual Studio 9.0\VC\include\stdio.h(237) : see declaration of 'fopen'
mapper_config.cpp
..\flow2d3d\src\dd\mapper\mapper_config.cpp(72) : warning C4996: 'sscanf': This function or variable may be unsafe. Consider using sscanf_s instead. To disable deprecation, use _CRT_SECURE_NO_WARNINGS. See online help for details.
c:\Program Files (x86)\Microsoft Visual Studio 9.0\VC\include\stdio.h(324) : see declaration of 'sscanf'
..\flow2d3d\src\dd\mapper\mapper_config.cpp(165) : warning C4996: 'fopen': This function or variable may be unsafe. Consider using fopen_s instead. To disable deprecation, use _CRT_SECURE_NO_WARNINGS. See online help for details.
c:\Program Files (x86)\Microsoft Visual Studio 9.0\VC\include\stdio.h(237) : see declaration of 'fopen'
map_messages.cpp
map_debug.cpp
..\flow2d3d\src\dd\mapper\map_debug.cpp(113) : warning C4996: 'fopen': This function or variable may be unsafe. Consider using fopen_s instead. To disable deprecation, use _CRT_SECURE_NO_WARNINGS. See online help for details.
c:\Program Files (x86)\Microsoft Visual Studio 9.0\VC\include\stdio.h(237) : see declaration of 'fopen'
hymapper.cpp
gaws_wang_eq.cpp
gaws.cpp
..\flow2d3d\src\dd\mapper\gaws.cpp(1049) : warning C4996: 'sprintf': This function or variable may be unsafe. Consider using sprintf_s instead. To disable deprecation, use _CRT_SECURE_NO_WARNINGS. See online help for details.
c:\Program Files (x86)\Microsoft Visual Studio 9.0\VC\include\stdio.h(366) : see declaration of 'sprintf'
..\flow2d3d\src\dd\mapper\gaws.cpp(1050) : warning C4996: 'fopen': This function or variable may be unsafe. Consider using fopen_s instead. To disable deprecation, use _CRT_SECURE_NO_WARNINGS. See online help for details.
c:\Program Files (x86)\Microsoft Visual Studio 9.0\VC\include\stdio.h(237) : see declaration of 'fopen'
..\flow2d3d\src\dd\mapper\gaws.cpp(1751) : warning C4996: 'strcpy': This function or variable may be unsafe. Consider using strcpy_s instead. To disable deprecation, use _CRT_SECURE_NO_WARNINGS. See online help for details.
c:\Program Files (x86)\Microsoft Visual Studio 9.0\VC\include\string.h(74) : see declaration of 'strcpy'
flow_nxtstp.cpp
..\flow2d3d\src\dd\mapper\flow_nxtstp.cpp(255) : warning C4297: 'GWSSLV' : function assumed not to throw an exception but does
__declspec(nothrow) or throw() was specified on the function
..\flow2d3d\src\dd\mapper\flow_nxtstp.cpp(323) : warning C4297: 'GWSSLV' : function assumed not to throw an exception but does
__declspec(nothrow) or throw() was specified on the function
..\flow2d3d\src\dd\mapper\flow_nxtstp.cpp(420) : warning C4297: 'COMMUNICATENEXTSTEPWITHMAPPER' : function assumed not to throw an exception but does
__declspec(nothrow) or throw() was specified on the function
..\flow2d3d\src\dd\mapper\flow_nxtstp.cpp(513) : warning C4297: 'COMMUNICATENEXTSTEPWITHMAPPER' : function assumed not to throw an exception but does
__declspec(nothrow) or throw() was specified on the function
..\flow2d3d\src\dd\mapper\flow_nxtstp.cpp(558) : warning C4297: 'COMMUNICATENEXTSTEPWITHMAPPER' : function assumed not to throw an exception but does
__declspec(nothrow) or throw() was specified on the function
..\flow2d3d\src\dd\mapper\flow_nxtstp.cpp(659) : warning C4996: 'strncpy': This function or variable may be unsafe. Consider using strncpy_s instead. To disable deprecation, use _CRT_SECURE_NO_WARNINGS. See online help for details.
c:\Program Files (x86)\Microsoft Visual Studio 9.0\VC\include\string.h(157) : see declaration of 'strncpy'
context_general_functs.cpp
..\flow2d3d\src\dd\mapper\context_general_functs.cpp(569) : warning C4996: 'sprintf': This function or variable may be unsafe. Consider using sprintf_s instead. To disable deprecation, use _CRT_SECURE_NO_WARNINGS. See online help for details.
c:\Program Files (x86)\Microsoft Visual Studio 9.0\VC\include\stdio.h(366) : see declaration of 'sprintf'
..\flow2d3d\src\dd\mapper\context_general_functs.cpp(570) : warning C4996: 'fopen': This function or variable may be unsafe. Consider using fopen_s instead. To disable deprecation, use _CRT_SECURE_NO_WARNINGS. See online help for details.
c:\Program Files (x86)\Microsoft Visual Studio 9.0\VC\include\stdio.h(237) : see declaration of 'fopen'
context_distrib_functs.cpp
context-mapside.cpp
context-gawsside.cpp
context-flowside.cpp
rtcComm.cpp
..\flow2d3d\src\dd\iterators\rtcComm.cpp(175) : warning C4018: '<' : signed/unsigned mismatch
..\flow2d3d\src\dd\iterators\rtcComm.cpp(183) : warning C4018: '<' : signed/unsigned mismatch
..\flow2d3d\src\dd\iterators\rtcComm.cpp(189) : warning C4018: '<' : signed/unsigned mismatch
..\flow2d3d\src\dd\iterators\rtcComm.cpp(206) : warning C4018: '<' : signed/unsigned mismatch
..\flow2d3d\src\dd\iterators\rtcComm.cpp(214) : warning C4018: '<' : signed/unsigned mismatch
..\flow2d3d\src\dd\iterators\rtcComm.cpp(221) : warning C4018: '<' : signed/unsigned mismatch
..\flow2d3d\src\dd\iterators\rtcComm.cpp(251) : warning C4297: 'RTCSTARTCOMMUNICATION' : function assumed not to throw an exception but does
The function is extern "C" and /EHc was specified
..\flow2d3d\src\dd\iterators\rtcComm.cpp(255) : warning C4297: 'RTCSTARTCOMMUNICATION' : function assumed not to throw an exception but does
The function is extern "C" and /EHc was specified
..\flow2d3d\src\dd\iterators\rtcComm.cpp(274) : warning C4297: 'RTCSTARTCOMMUNICATION' : function assumed not to throw an exception but does
The function is extern "C" and /EHc was specified
..\flow2d3d\src\dd\iterators\rtcComm.cpp(300) : warning C4297: 'RTCCOMMUNICATE' : function assumed not to throw an exception but does
The function is extern "C" and /EHc was specified
..\flow2d3d\src\dd\iterators\rtcComm.cpp(304) : warning C4297: 'RTCCOMMUNICATE' : function assumed not to throw an exception but does
The function is extern "C" and /EHc was specified
..\flow2d3d\src\dd\iterators\rtcComm.cpp(333) : warning C4297: 'RTCCOMMUNICATE' : function assumed not to throw an exception but does
The function is extern "C" and /EHc was specified
..\flow2d3d\src\dd\iterators\rtcComm.cpp(358) : warning C4297: 'RTCCHARCOMMUNICATE' : function assumed not to throw an exception but does
The function is extern "C" and /EHc was specified
..\flow2d3d\src\dd\iterators\rtcComm.cpp(362) : warning C4297: 'RTCCHARCOMMUNICATE' : function assumed not to throw an exception but does
The function is extern "C" and /EHc was specified
..\flow2d3d\src\dd\iterators\rtcComm.cpp(390) : warning C4297: 'RTCCHARCOMMUNICATE' : function assumed not to throw an exception but does
The function is extern "C" and /EHc was specified
minimumBarrier.cpp
initBarrier.cpp
..\flow2d3d\src\dd\iterators\initBarrier.cpp(115) : warning C4297: 'INITFINISHED' : function assumed not to throw an exception but does
The function is extern "C" and /EHc was specified
..\flow2d3d\src\dd\iterators\initBarrier.cpp(131) : warning C4297: 'INITFINISHED' : function assumed not to throw an exception but does
The function is extern "C" and /EHc was specified
gawsBarrier.cpp
Compiling...
dredgeMerge.cpp
..\flow2d3d\src\dd\iterators\dredgeMerge.cpp(164) : warning C4018: '<' : signed/unsigned mismatch
..\flow2d3d\src\dd\iterators\dredgeMerge.cpp(172) : warning C4018: '<' : signed/unsigned mismatch
..\flow2d3d\src\dd\iterators\dredgeMerge.cpp(178) : warning C4018: '<' : signed/unsigned mismatch
..\flow2d3d\src\dd\iterators\dredgeMerge.cpp(210) : warning C4297: 'DREDGESTARTCOMMUNICATE' : function assumed not to throw an exception but does
The function is extern "C" and /EHc was specified
..\flow2d3d\src\dd\iterators\dredgeMerge.cpp(214) : warning C4297: 'DREDGESTARTCOMMUNICATE' : function assumed not to throw an exception but does
The function is extern "C" and /EHc was specified
..\flow2d3d\src\dd\iterators\dredgeMerge.cpp(231) : warning C4297: 'DREDGESTARTCOMMUNICATE' : function assumed not to throw an exception but does
The function is extern "C" and /EHc was specified
..\flow2d3d\src\dd\iterators\dredgeMerge.cpp(259) : warning C4297: 'DREDGECOMMUNICATE' : function assumed not to throw an exception but does
The function is extern "C" and /EHc was specified
..\flow2d3d\src\dd\iterators\dredgeMerge.cpp(263) : warning C4297: 'DREDGECOMMUNICATE' : function assumed not to throw an exception but does
The function is extern "C" and /EHc was specified
..\flow2d3d\src\dd\iterators\dredgeMerge.cpp(290) : warning C4297: 'DREDGECOMMUNICATE' : function assumed not to throw an exception but does
The function is extern "C" and /EHc was specified
threads.cpp
..\flow2d3d\src\dd\threads.cpp(51) : warning C4996: 'strerror': This function or variable may be unsafe. Consider using strerror_s instead. To disable deprecation, use _CRT_SECURE_NO_WARNINGS. See online help for details.
c:\Program Files (x86)\Microsoft Visual Studio 9.0\VC\include\string.h(126) : see declaration of 'strerror'
..\flow2d3d\src\dd\threads.cpp(53) : warning C4996: 'strerror': This function or variable may be unsafe. Consider using strerror_s instead. To disable deprecation, use _CRT_SECURE_NO_WARNINGS. See online help for details.
c:\Program Files (x86)\Microsoft Visual Studio 9.0\VC\include\string.h(126) : see declaration of 'strerror'
..\flow2d3d\src\dd\threads.cpp(58) : warning C4996: 'strerror': This function or variable may be unsafe. Consider using strerror_s instead. To disable deprecation, use _CRT_SECURE_NO_WARNINGS. See online help for details.
c:\Program Files (x86)\Microsoft Visual Studio 9.0\VC\include\string.h(126) : see declaration of 'strerror'
..\flow2d3d\src\dd\threads.cpp(63) : warning C4996: 'strerror': This function or variable may be unsafe. Consider using strerror_s instead. To disable deprecation, use _CRT_SECURE_NO_WARNINGS. See online help for details.
c:\Program Files (x86)\Microsoft Visual Studio 9.0\VC\include\string.h(126) : see declaration of 'strerror'
..\flow2d3d\src\dd\threads.cpp(69) : warning C4996: 'strerror': This function or variable may be unsafe. Consider using strerror_s instead. To disable deprecation, use _CRT_SECURE_NO_WARNINGS. See online help for details.
c:\Program Files (x86)\Microsoft Visual Studio 9.0\VC\include\string.h(126) : see declaration of 'strerror'
..\flow2d3d\src\dd\threads.cpp(78) : warning C4996: 'strerror': This function or variable may be unsafe. Consider using strerror_s instead. To disable deprecation, use _CRT_SECURE_NO_WARNINGS. See online help for details.
c:\Program Files (x86)\Microsoft Visual Studio 9.0\VC\include\string.h(126) : see declaration of 'strerror'
..\flow2d3d\src\dd\threads.cpp(82) : warning C4996: 'strerror': This function or variable may be unsafe. Consider using strerror_s instead. To disable deprecation, use _CRT_SECURE_NO_WARNINGS. See online help for details.
c:\Program Files (x86)\Microsoft Visual Studio 9.0\VC\include\string.h(126) : see declaration of 'strerror'
..\flow2d3d\src\dd\threads.cpp(103) : warning C4996: 'strerror': This function or variable may be unsafe. Consider using strerror_s instead. To disable deprecation, use _CRT_SECURE_NO_WARNINGS. See online help for details.
c:\Program Files (x86)\Microsoft Visual Studio 9.0\VC\include\string.h(126) : see declaration of 'strerror'
semaphore.cpp
..\flow2d3d\src\dd\semaphore.cpp(58) : warning C4996: 'strcpy': This function or variable may be unsafe. Consider using strcpy_s instead. To disable deprecation, use _CRT_SECURE_NO_WARNINGS. See online help for details.
c:\Program Files (x86)\Microsoft Visual Studio 9.0\VC\include\string.h(74) : see declaration of 'strcpy'
node.cpp
..\flow2d3d\src\dd\node.cpp(127) : warning C4996: 'fopen': This function or variable may be unsafe. Consider using fopen_s instead. To disable deprecation, use _CRT_SECURE_NO_WARNINGS. See online help for details.
c:\Program Files (x86)\Microsoft Visual Studio 9.0\VC\include\stdio.h(237) : see declaration of 'fopen'
..\flow2d3d\src\dd\node.cpp(129) : warning C4996: 'strerror': This function or variable may be unsafe. Consider using strerror_s instead. To disable deprecation, use _CRT_SECURE_NO_WARNINGS. See online help for details.
c:\Program Files (x86)\Microsoft Visual Studio 9.0\VC\include\string.h(126) : see declaration of 'strerror'
list.cpp
iterator.cpp
..\flow2d3d\src\dd\iterator.cpp(80) : warning C4996: 'strcpy': This function or variable may be unsafe. Consider using strcpy_s instead. To disable deprecation, use _CRT_SECURE_NO_WARNINGS. See online help for details.
c:\Program Files (x86)\Microsoft Visual Studio 9.0\VC\include\string.h(74) : see declaration of 'strcpy'
..\flow2d3d\src\dd\iterator.cpp(106) : warning C4996: 'strcpy': This function or variable may be unsafe. Consider using strcpy_s instead. To disable deprecation, use _CRT_SECURE_NO_WARNINGS. See online help for details.
c:\Program Files (x86)\Microsoft Visual Studio 9.0\VC\include\string.h(74) : see declaration of 'strcpy'
..\flow2d3d\src\dd\iterator.cpp(499) : warning C4996: 'sprintf': This function or variable may be unsafe. Consider using sprintf_s instead. To disable deprecation, use _CRT_SECURE_NO_WARNINGS. See online help for details.
c:\Program Files (x86)\Microsoft Visual Studio 9.0\VC\include\stdio.h(366) : see declaration of 'sprintf'
distributed.cpp
..\flow2d3d\src\dd\distributed.cpp(563) : warning C4554: '&' : check operator precedence for possible error; use parentheses to clarify precedence
dictionary.cpp
..\flow2d3d\src\dd\dictionary.cpp(83) : warning C4996: 'strcpy': This function or variable may be unsafe. Consider using strcpy_s instead. To disable deprecation, use _CRT_SECURE_NO_WARNINGS. See online help for details.
c:\Program Files (x86)\Microsoft Visual Studio 9.0\VC\include\string.h(74) : see declaration of 'strcpy'
dd.cpp
..\flow2d3d\src\dd\dd.cpp(288) : warning C4996: 'fopen': This function or variable may be unsafe. Consider using fopen_s instead. To disable deprecation, use _CRT_SECURE_NO_WARNINGS. See online help for details.
c:\Program Files (x86)\Microsoft Visual Studio 9.0\VC\include\stdio.h(237) : see declaration of 'fopen'
..\flow2d3d\src\dd\dd.cpp(346) : warning C4996: 'sscanf': This function or variable may be unsafe. Consider using sscanf_s instead. To disable deprecation, use _CRT_SECURE_NO_WARNINGS. See online help for details.
c:\Program Files (x86)\Microsoft Visual Studio 9.0\VC\include\stdio.h(324) : see declaration of 'sscanf'
..\flow2d3d\src\dd\dd.cpp(353) : warning C4996: 'sscanf': This function or variable may be unsafe. Consider using sscanf_s instead. To disable deprecation, use _CRT_SECURE_NO_WARNINGS. See online help for details.
c:\Program Files (x86)\Microsoft Visual Studio 9.0\VC\include\stdio.h(324) : see declaration of 'sscanf'
..\flow2d3d\src\dd\dd.cpp(363) : warning C4996: 'sprintf': This function or variable may be unsafe. Consider using sprintf_s instead. To disable deprecation, use _CRT_SECURE_NO_WARNINGS. See online help for details.
c:\Program Files (x86)\Microsoft Visual Studio 9.0\VC\include\stdio.h(366) : see declaration of 'sprintf'
..\flow2d3d\src\dd\dd.cpp(426) : warning C4996: 'strcpy': This function or variable may be unsafe. Consider using strcpy_s instead. To disable deprecation, use _CRT_SECURE_NO_WARNINGS. See online help for details.
c:\Program Files (x86)\Microsoft Visual Studio 9.0\VC\include\string.h(74) : see declaration of 'strcpy'
..\flow2d3d\src\dd\dd.cpp(502) : warning C4996: 'sprintf': This function or variable may be unsafe. Consider using sprintf_s instead. To disable deprecation, use _CRT_SECURE_NO_WARNINGS. See online help for details.
c:\Program Files (x86)\Microsoft Visual Studio 9.0\VC\include\stdio.h(366) : see declaration of 'sprintf'
..\flow2d3d\src\dd\dd.cpp(557) : warning C4996: 'strncpy': This function or variable may be unsafe. Consider using strncpy_s instead. To disable deprecation, use _CRT_SECURE_NO_WARNINGS. See online help for details.
c:\Program Files (x86)\Microsoft Visual Studio 9.0\VC\include\string.h(157) : see declaration of 'strncpy'
..\flow2d3d\src\dd\dd.cpp(572) : warning C4996: 'open': The POSIX name for this item is deprecated. Instead, use the ISO C++ conformant name: _open. See online help for details.
c:\Program Files (x86)\Microsoft Visual Studio 9.0\VC\include\io.h(316) : see declaration of 'open'
..\flow2d3d\src\dd\dd.cpp(576) : warning C4996: 'close': The POSIX name for this item is deprecated. Instead, use the ISO C++ conformant name: _close. See online help for details.
c:\Program Files (x86)\Microsoft Visual Studio 9.0\VC\include\io.h(306) : see declaration of 'close'
..\flow2d3d\src\dd\dd.cpp(580) : warning C4996: 'close': The POSIX name for this item is deprecated. Instead, use the ISO C++ conformant name: _close. See online help for details.
c:\Program Files (x86)\Microsoft Visual Studio 9.0\VC\include\io.h(306) : see declaration of 'close'
..\flow2d3d\src\dd\dd.cpp(620) : warning C4996: 'strcpy': This function or variable may be unsafe. Consider using strcpy_s instead. To disable deprecation, use _CRT_SECURE_NO_WARNINGS. See online help for details.
c:\Program Files (x86)\Microsoft Visual Studio 9.0\VC\include\string.h(74) : see declaration of 'strcpy'
..\flow2d3d\src\dd\dd.cpp(622) : warning C4996: 'strcpy': This function or variable may be unsafe. Consider using strcpy_s instead. To disable deprecation, use _CRT_SECURE_NO_WARNINGS. See online help for details.
c:\Program Files (x86)\Microsoft Visual Studio 9.0\VC\include\string.h(74) : see declaration of 'strcpy'
..\flow2d3d\src\dd\dd.cpp(624) : warning C4996: 'strncpy': This function or variable may be unsafe. Consider using strncpy_s instead. To disable deprecation, use _CRT_SECURE_NO_WARNINGS. See online help for details.
c:\Program Files (x86)\Microsoft Visual Studio 9.0\VC\include\string.h(157) : see declaration of 'strncpy'
..\flow2d3d\src\dd\dd.cpp(655) : warning C4996: 'sprintf': This function or variable may be unsafe. Consider using sprintf_s instead. To disable deprecation, use _CRT_SECURE_NO_WARNINGS. See online help for details.
c:\Program Files (x86)\Microsoft Visual Studio 9.0\VC\include\stdio.h(366) : see declaration of 'sprintf'
..\flow2d3d\src\dd\dd.cpp(665) : warning C4996: 'sprintf': This function or variable may be unsafe. Consider using sprintf_s instead. To disable deprecation, use _CRT_SECURE_NO_WARNINGS. See online help for details.
c:\Program Files (x86)\Microsoft Visual Studio 9.0\VC\include\stdio.h(366) : see declaration of 'sprintf'
..\flow2d3d\src\dd\dd.cpp(783) : warning C4996: 'sprintf': This function or variable may be unsafe. Consider using sprintf_s instead. To disable deprecation, use _CRT_SECURE_NO_WARNINGS. See online help for details.
c:\Program Files (x86)\Microsoft Visual Studio 9.0\VC\include\stdio.h(366) : see declaration of 'sprintf'
category.cpp
..\flow2d3d\src\dd\category.cpp(66) : warning C4996: 'strcpy': This function or variable may be unsafe. Consider using strcpy_s instead. To disable deprecation, use _CRT_SECURE_NO_WARNINGS. See online help for details.
c:\Program Files (x86)\Microsoft Visual Studio 9.0\VC\include\string.h(74) : see declaration of 'strcpy'
..\flow2d3d\src\dd\category.cpp(69) : warning C4996: 'strcpy': This function or variable may be unsafe. Consider using strcpy_s instead. To disable deprecation, use _CRT_SECURE_NO_WARNINGS. See online help for details.
c:\Program Files (x86)\Microsoft Visual Studio 9.0\VC\include\string.h(74) : see declaration of 'strcpy'
blob.cpp
readxmldd.cpp
flowol.cpp
..\flow2d3d\src\flowol.cpp(92) : warning C4996: 'sscanf': This function or variable may be unsafe. Consider using sscanf_s instead. To disable deprecation, use _CRT_SECURE_NO_WARNINGS. See online help for details.
c:\Program Files (x86)\Microsoft Visual Studio 9.0\VC\include\stdio.h(324) : see declaration of 'sscanf'
..\flow2d3d\src\flowol.cpp(112) : warning C4996: 'fopen': This function or variable may be unsafe. Consider using fopen_s instead. To disable deprecation, use _CRT_SECURE_NO_WARNINGS. See online help for details.
c:\Program Files (x86)\Microsoft Visual Studio 9.0\VC\include\stdio.h(237) : see declaration of 'fopen'
..\flow2d3d\src\flowol.cpp(114) : warning C4996: 'strerror': This function or variable may be unsafe. Consider using strerror_s instead. To disable deprecation, use _CRT_SECURE_NO_WARNINGS. See online help for details.
c:\Program Files (x86)\Microsoft Visual Studio 9.0\VC\include\string.h(126) : see declaration of 'strerror'
..\flow2d3d\src\flowol.cpp(242) : warning C4297: 'FLOWOL_ARRAYSHAPE' : function assumed not to throw an exception but does
The function is extern "C" and /EHc was specified
..\flow2d3d\src\flowol.cpp(268) : warning C4297: 'FLOWOL_CHANGEDIRECTORY' : function assumed not to throw an exception but does
The function is extern "C" and /EHc was specified
..\flow2d3d\src\flowol.cpp(326) : warning C4297: 'FLOWOL_PUBLISH_C' : function assumed not to throw an exception but does
The function is extern "C" and /EHc was specified
..\flow2d3d\src\flowol.cpp(420) : warning C4297: 'FLOWOL_PUBLISHFUNCTION' : function assumed not to throw an exception but does
The function is extern "C" and /EHc was specified
..\flow2d3d\src\flowol.cpp(453) : warning C4996: 'sprintf': This function or variable may be unsafe. Consider using sprintf_s instead. To disable deprecation, use _CRT_SECURE_NO_WARNINGS. See online help for details.
c:\Program Files (x86)\Microsoft Visual Studio 9.0\VC\include\stdio.h(366) : see declaration of 'sprintf'
..\flow2d3d\src\flowol.cpp(463) : warning C4297: 'FLOWOL_SETDESCRIPTION' : function assumed not to throw an exception but does
The function is extern "C" and /EHc was specified
..\flow2d3d\src\flowol.cpp(486) : warning C4297: 'FLOWOL_TIMESTEP' : function assumed not to throw an exception but does
The function is extern "C" and /EHc was specified
..\flow2d3d\src\flowol.cpp(514) : warning C4297: 'FLOWOL_RETRACT' : function assumed not to throw an exception but does
The function is extern "C" and /EHc was specified
..\flow2d3d\src\flowol.cpp(540) : warning C4297: 'FLOWOL_RETRACTARRAYSHAPE' : function assumed not to throw an exception but does
The function is extern "C" and /EHc was specified
..\flow2d3d\src\flowol.cpp(566) : warning C4297: 'FLOWOL_RETRACTFUNCTION' : function assumed not to throw an exception but does
The function is extern "C" and /EHc was specified
flow2d3d_version.cpp
..\flow2d3d\src\flow2d3d_version.cpp(57) : warning C4996: 'strncpy': This function or variable may be unsafe. Consider using strncpy_s instead. To disable deprecation, use _CRT_SECURE_NO_WARNINGS. See online help for details.
c:\Program Files (x86)\Microsoft Visual Studio 9.0\VC\include\string.h(157) : see declaration of 'strncpy'
..\flow2d3d\src\flow2d3d_version.cpp(65) : warning C4996: 'strncpy': This function or variable may be unsafe. Consider using strncpy_s instead. To disable deprecation, use _CRT_SECURE_NO_WARNINGS. See online help for details.
c:\Program Files (x86)\Microsoft Visual Studio 9.0\VC\include\string.h(157) : see declaration of 'strncpy'
..\flow2d3d\src\flow2d3d_version.cpp(73) : warning C4996: 'strncpy': This function or variable may be unsafe. Consider using strncpy_s instead. To disable deprecation, use _CRT_SECURE_NO_WARNINGS. See online help for details.
c:\Program Files (x86)\Microsoft Visual Studio 9.0\VC\include\string.h(157) : see declaration of 'strncpy'
..\flow2d3d\src\flow2d3d_version.cpp(81) : warning C4996: 'strncpy': This function or variable may be unsafe. Consider using strncpy_s instead. To disable deprecation, use _CRT_SECURE_NO_WARNINGS. See online help for details.
c:\Program Files (x86)\Microsoft Visual Studio 9.0\VC\include\string.h(157) : see declaration of 'strncpy'
..\flow2d3d\src\flow2d3d_version.cpp(89) : warning C4996: 'strncpy': This function or variable may be unsafe. Consider using strncpy_s instead. To disable deprecation, use _CRT_SECURE_NO_WARNINGS. See online help for details.
c:\Program Files (x86)\Microsoft Visual Studio 9.0\VC\include\string.h(157) : see declaration of 'strncpy'
..\flow2d3d\src\flow2d3d_version.cpp(97) : warning C4996: 'strncpy': This function or variable may be unsafe. Consider using strncpy_s instead. To disable deprecation, use _CRT_SECURE_NO_WARNINGS. See online help for details.
c:\Program Files (x86)\Microsoft Visual Studio 9.0\VC\include\string.h(157) : see declaration of 'strncpy'
flow2d3d_openda_version.cpp
.\src\flow2d3d_openda_version.cpp(57) : warning C4996: 'strncpy': This function or variable may be unsafe. Consider using strncpy_s instead. To disable deprecation, use _CRT_SECURE_NO_WARNINGS. See online help for details.
c:\Program Files (x86)\Microsoft Visual Studio 9.0\VC\include\string.h(157) : see declaration of 'strncpy'
.\src\flow2d3d_openda_version.cpp(65) : warning C4996: 'strncpy': This function or variable may be unsafe. Consider using strncpy_s instead. To disable deprecation, use _CRT_SECURE_NO_WARNINGS. See online help for details.
c:\Program Files (x86)\Microsoft Visual Studio 9.0\VC\include\string.h(157) : see declaration of 'strncpy'
flow2d3d.cpp
..\flow2d3d\src\flow2d3d.cpp(200) : warning C4996: 'fopen': This function or variable may be unsafe. Consider using fopen_s instead. To disable deprecation, use _CRT_SECURE_NO_WARNINGS. See online help for details.
c:\Program Files (x86)\Microsoft Visual Studio 9.0\VC\include\stdio.h(237) : see declaration of 'fopen'
Linking...
LINK : fatal error LNK1181: cannot open input file '..\..\bin\release\flow2d3d.lib'
Project : warning PRJ0018 : The following environment variables were not found:
$(IFORT_COMPILER13 )
Build log was saved at "file://c:\delft3d_repository\src\engines_gpl\flow2d3d\packages\flow2d3d_openda\Release\BuildLog.htm"
flow2d3d_openda - 1 error(s), 99 warning(s)
------ Build started: Project: kubint_f, Configuration: Release Win32 ------
Compiling with Intel(R) Visual Fortran Compiler XE 13.0.1.119 [IA-32]...
precision.f90
readldb.f90
ipon.f90
indexx.f90
pldep.F90
hunt.f90
mkmap.f90
grmap.f90
C:\delft3d_repository\src\tools_gpl\kubint\packages\kubint_f\src\grmap.f90(72): remark #8291: Recommended relationship between field width 'W' and the number of fractional digits 'D' in this edit descriptor is 'W>=D+7'.
minmax.f90
bilin5.f90
sort.f90
kubint.f90
Creating library...

Build log written to "file://C:\delft3d_repository\src\tools_gpl\kubint\packages\kubint_f\Release\BuildLog.txt"
kubint_f - 0 error(s), 0 warning(s)
------ Build started: Project: lint_f, Configuration: Release Win32 ------
Compiling with Intel(R) Visual Fortran Compiler XE 13.0.1.119 [IA-32]...
precision.f90
sort.f90
ipon.f90
readldb.f90
indexx.f90
hunt.f90
pldep.F90
mkmap.f90
grmap.f90
C:\delft3d_repository\src\tools_gpl\lint\packages\lint_f\src\grmap.f90(72): remark #8291: Recommended relationship between field width 'W' and the number of fractional digits 'D' in this edit descriptor is 'W>=D+7'.
lint.f90
bilin5.f90
Creating library...

Build log written to "file://C:\delft3d_repository\src\tools_gpl\lint\packages\lint_f\Release\BuildLog.txt"
lint_f - 0 error(s), 0 warning(s)
------ Build started: Project: kubint_version_number, Configuration: Release Win32 ------
Performing Pre-Build Event...
..\..\..\..\scripts_lgpl\win32\make_revision.bat: Regenerating existing file '.\include\version_number.h'.
..\..\..\..\scripts_lgpl\win32\make_revision.bat: executing c:\delft3d_repository\src\third_party_open\subversion\bin\win32\svnversion.exe -n
..\..\..\..\scripts_lgpl\win32\make_revision.bat: 2042M
..\..\..\..\scripts_lgpl\win32\make_revision.bat: executing version_number.exe 2042M ".\include\version_number.ini" ".\include\version_number.h.svn" ".\include\version_number.h"
..\..\..\..\scripts_lgpl\win32\make_revision.bat: Regenerating existing file '.\include\version_number.rc'.
..\..\..\..\scripts_lgpl\win32\make_revision.bat: build exists
..\..\..\..\scripts_lgpl\win32\make_revision.bat: 2042M
..\..\..\..\scripts_lgpl\win32\make_revision.bat: executing version_number.exe 2042M ".\include\version_number.ini" ".\include\version_number.rc.svn" ".\include\version_number.rc"
Compiling...
c2c.c
version.c
f2c.c
Creating library...
Performing Post-Build Event...
Build log was saved at "file://c:\delft3d_repository\src\tools_gpl\kubint\packages\kubint_version_number\Release\BuildLog.htm"
kubint_version_number - 0 error(s), 0 warning(s)
------ Build started: Project: lint_version_number, Configuration: Release Win32 ------
Performing Pre-Build Event...
..\..\..\..\scripts_lgpl\win32\make_revision.bat: Regenerating existing file '.\include\version_number.h'.
..\..\..\..\scripts_lgpl\win32\make_revision.bat: executing c:\delft3d_repository\src\third_party_open\subversion\bin\win32\svnversion.exe -n
..\..\..\..\scripts_lgpl\win32\make_revision.bat: 2042M
..\..\..\..\scripts_lgpl\win32\make_revision.bat: executing version_number.exe 2042M ".\include\version_number.ini" ".\include\version_number.h.svn" ".\include\version_number.h"
..\..\..\..\scripts_lgpl\win32\make_revision.bat: Regenerating existing file '.\include\version_number.rc'.
..\..\..\..\scripts_lgpl\win32\make_revision.bat: build exists
..\..\..\..\scripts_lgpl\win32\make_revision.bat: 2042M
..\..\..\..\scripts_lgpl\win32\make_revision.bat: executing version_number.exe 2042M ".\include\version_number.ini" ".\include\version_number.rc.svn" ".\include\version_number.rc"
Compiling...
c2c.c
version.c
f2c.c
Creating library...
Performing Post-Build Event...
Build log was saved at "file://c:\delft3d_repository\src\tools_gpl\lint\packages\lint_version_number\Release\BuildLog.htm"
lint_version_number - 0 error(s), 0 warning(s)
------ Build started: Project: vs_version_number, Configuration: Release Win32 ------
Performing Pre-Build Event...
..\..\..\..\scripts_lgpl\win32\make_revision.bat: Regenerating existing file '.\include\version_number.h'.
..\..\..\..\scripts_lgpl\win32\make_revision.bat: executing c:\delft3d_repository\src\third_party_open\subversion\bin\win32\svnversion.exe -n
..\..\..\..\scripts_lgpl\win32\make_revision.bat: 2042
..\..\..\..\scripts_lgpl\win32\make_revision.bat: executing version_number.exe 2042 ".\include\version_number.ini" ".\include\version_number.h.svn" ".\include\version_number.h"
..\..\..\..\scripts_lgpl\win32\make_revision.bat: Regenerating existing file '.\include\version_number.rc'.
..\..\..\..\scripts_lgpl\win32\make_revision.bat: build exists
..\..\..\..\scripts_lgpl\win32\make_revision.bat: 2042
..\..\..\..\scripts_lgpl\win32\make_revision.bat: executing version_number.exe 2042 ".\include\version_number.ini" ".\include\version_number.rc.svn" ".\include\version_number.rc"
Compiling...
c2c.c
version.c
f2c.c
Creating library...
Performing Post-Build Event...
Build log was saved at "file://c:\delft3d_repository\src\tools_gpl\vs\packages\vs_version_number\Release\BuildLog.htm"
vs_version_number - 0 error(s), 0 warning(s)
------ Build started: Project: mormerge_version_number, Configuration: Release Win32 ------
Performing Pre-Build Event...
..\..\..\..\scripts_lgpl\win32\make_revision.bat: Regenerating existing file '.\include\version_number.h'.
..\..\..\..\scripts_lgpl\win32\make_revision.bat: executing c:\delft3d_repository\src\third_party_open\subversion\bin\win32\svnversion.exe -n
..\..\..\..\scripts_lgpl\win32\make_revision.bat: 2042
..\..\..\..\scripts_lgpl\win32\make_revision.bat: executing version_number.exe 2042 ".\include\version_number.ini" ".\include\version_number.h.svn" ".\include\version_number.h"
..\..\..\..\scripts_lgpl\win32\make_revision.bat: Regenerating existing file '.\include\version_number.rc'.
..\..\..\..\scripts_lgpl\win32\make_revision.bat: build exists
..\..\..\..\scripts_lgpl\win32\make_revision.bat: 2042
..\..\..\..\scripts_lgpl\win32\make_revision.bat: executing version_number.exe 2042 ".\include\version_number.ini" ".\include\version_number.rc.svn" ".\include\version_number.rc"
Compiling...
c2c.c
version.c
f2c.c
Creating library...
Performing Post-Build Event...
Build log was saved at "file://c:\delft3d_repository\src\tools_gpl\mormerge\packages\mormerge_version_number\Release\BuildLog.htm"
mormerge_version_number - 0 error(s), 0 warning(s)
------ Build started: Project: datsel_f, Configuration: Release Win32 ------
Compiling with Intel(R) Visual Fortran Compiler XE 13.0.1.119 [IA-32]...
util.f90
concat.f90
ntstop.f90
nefout.f90
precision.f90
co1cen.f90
uv2cen.f90
dir2uv.f90
datsel.f90
cur2ca.f90
pldep.F90
co2cen.f90
vecmag.f90
Creating library...

Build log written to "file://C:\delft3d_repository\src\tools_gpl\datsel\packages\datsel_f\Release\BuildLog.txt"
datsel_f - 0 error(s), 0 warning(s)
------ Build started: Project: manager (engines_gpl\wave\manager), Configuration: Release Win32 ------
Compiling with Intel(R) Visual Fortran Compiler XE 13.0.1.119 [IA-32]...
swan_tot.f90
Creating library...

Build log written to "file://C:\delft3d_repository\src\engines_gpl\wave\packages\manager\Release\BuildLog.htm"
manager - 0 error(s), 0 warning(s)
------ Build started: Project: wave (engines_gpl\wave\wave), Configuration: Release Win32 ------
Performing Pre-Build Event...
Generating version number in '.\src\wave_version.F90' ...
..\..\..\..\scripts_lgpl\win32\update_version.cmd: Regenerating existing file '.\src\wave_version.F90'.
Compiling with Intel(R) Visual Fortran Compiler XE 13.0.1.119 [IA-32]...
wave_version.F90
usage.f90
checklicense.f90
wave.f90
Linking...
Generating code
Finished generating code
Embedding manifest...
Performing Post-Build Event...
oss-install...
Target directory: ..\bin
Source : package/engine wave
1 file(s) copied.
"installing wave . . ."
C:\delft3d_repository\src\engines_gpl\wave\bin\release\wave.exe -> C:\delft3d_repository\bin\win32\wave\bin\wave.exe
1 File(s) copied
C:\delft3d_repository\src\engines_gpl\flow2d3d\default\dioconfig.ini -> C:\delft3d_repository\bin\win32\wave\default\dioconfig.ini
1 File(s) copied
C:\delft3d_repository\src\third_party_open\intel_fortran\lib\win32\libifcoremd.dll -> C:\delft3d_repository\bin\win32\wave\lib\libifcoremd.dll
C:\delft3d_repository\src\third_party_open\intel_fortran\lib\win32\libifportmd.dll -> C:\delft3d_repository\bin\win32\wave\lib\libifportmd.dll
C:\delft3d_repository\src\third_party_open\intel_fortran\lib\win32\libmmd.dll -> C:\delft3d_repository\bin\win32\wave\lib\libmmd.dll
3 File(s) copied
C:\delft3d_repository\src\third_party_open\swan\lib\win32\libifcoremd.dll -> C:\delft3d_repository\bin\win32\swan\lib\libifcoremd.dll
C:\delft3d_repository\src\third_party_open\swan\lib\win32\libifportmd.dll -> C:\delft3d_repository\bin\win32\swan\lib\libifportmd.dll
C:\delft3d_repository\src\third_party_open\swan\lib\win32\libiomp5md.dll -> C:\delft3d_repository\bin\win32\swan\lib\libiomp5md.dll
C:\delft3d_repository\src\third_party_open\swan\lib\win32\libmmd.dll -> C:\delft3d_repository\bin\win32\swan\lib\libmmd.dll
4 File(s) copied
C:\delft3d_repository\src\third_party_open\swan\bin\win32\swan_4072ABCDE_del_w32_i11_omp.exe -> C:\delft3d_repository\bin\win32\swan\bin\swan_4072ABCDE_del_w32_i11_omp.exe
1 File(s) copied
C:\delft3d_repository\src\third_party_open\swan\scripts\swan_install.bat -> C:\delft3d_repository\bin\win32\swan\scripts\swan.bat
1 File(s) copied

Build log written to "file://C:\delft3d_repository\src\engines_gpl\wave\packages\wave\Release\BuildLog.htm"
wave - 0 error(s), 0 warning(s)
------ Build started: Project: ftnunit, Configuration: Release Win32 ------
Compiling with Intel(R) Visual Fortran Compiler XE 13.0.1.119 [IA-32]...
ftnunit_hooks_teamcity.f90
ftnunit.f90
ftnunit_store.f90
Creating library...

Build log written to "file://C:\delft3d_repository\src\utils_lgpl\ftnunit\packages\ftnunit\Release\BuildLog.htm"
ftnunit - 0 error(s), 0 warning(s)
------ Build started: Project: plugin_culvert (plugins_lgpl\plugin_culvert\plugin_culvert), Configuration: Release Win32 ------
Compiling with Intel(R) Visual Fortran Compiler XE 13.0.1.119 [IA-32]...
plugin_culvert.f90
Linking...
Creating library bin/Release/plugin_culvert.lib and object bin/Release/plugin_culvert.exp
Embedding manifest...
Performing Post-Build Event...
oss-install...
Target directory: ..\bin
Source : package/engine plugin_culvert
1 file(s) copied.
"installing plugin_culvert . . ."
C:\delft3d_repository\src\plugins_lgpl\plugin_culvert\bin\Release\plugin_culvert.dll -> C:\delft3d_repository\bin\win32\flow2d3d\bin\plugin_culvert.dll
1 File(s) copied

Build log written to "file://C:\delft3d_repository\src\plugins_lgpl\plugin_culvert\Release\BuildLog.htm"
plugin_culvert - 0 error(s), 0 warning(s)
------ Build started: Project: plugin_delftflow_traform (plugins_lgpl\plugin_delftflow_traform\plugin_delftflow_traform), Configuration: Release Win32 ------
Compiling with Intel(R) Visual Fortran Compiler XE 13.0.1.119 [IA-32]...
vrijn84_riv_77.f90
shld.f90
settling_velocity.f90
partheniades_krone.f90
engelund_hansen.f90
Linking...
Creating library bin/Release/plugin_delftflow_traform.lib and object bin/Release/plugin_delftflow_traform.exp
Embedding manifest...
Performing Post-Build Event...
oss-install...
Target directory: ..\bin
Source : package/engine plugin_delftflow_traform
1 file(s) copied.
"installing plugin_delftflow_traform . . ."
C:\delft3d_repository\src\plugins_lgpl\plugin_delftflow_traform\bin\Release\plugin_delftflow_traform.dll -> C:\delft3d_repository\bin\win32\flow2d3d\bin\plugin_delftflow_traform.dll
1 File(s) copied

Build log written to "file://C:\delft3d_repository\src\plugins_lgpl\plugin_delftflow_traform\Release\BuildLog.htm"
plugin_delftflow_traform - 0 error(s), 0 warning(s)
------ Build started: Project: d_hydro (engines_gpl\d_hydro\d_hydro), Configuration: Release Win32 ------
Performing Pre-Build Event...
Generating version number in '.\include\d_hydro_version.h' ...
..\..\..\..\scripts_lgpl\win32\update_version.cmd: Regenerating existing file '.\include\d_hydro_version.h'.
Compiling...
d_hydro_version.cpp
.\src\d_hydro_version.cpp(57) : warning C4996: 'strncpy': This function or variable may be unsafe. Consider using strncpy_s instead. To disable deprecation, use _CRT_SECURE_NO_WARNINGS. See online help for details.
c:\Program Files (x86)\Microsoft Visual Studio 9.0\VC\include\string.h(157) : see declaration of 'strncpy'
.\src\d_hydro_version.cpp(65) : warning C4996: 'strncpy': This function or variable may be unsafe. Consider using strncpy_s instead. To disable deprecation, use _CRT_SECURE_NO_WARNINGS. See online help for details.
c:\Program Files (x86)\Microsoft Visual Studio 9.0\VC\include\string.h(157) : see declaration of 'strncpy'
.\src\d_hydro_version.cpp(73) : warning C4996: 'strncpy': This function or variable may be unsafe. Consider using strncpy_s instead. To disable deprecation, use _CRT_SECURE_NO_WARNINGS. See online help for details.
c:\Program Files (x86)\Microsoft Visual Studio 9.0\VC\include\string.h(157) : see declaration of 'strncpy'
d_hydro.cpp
.\src\d_hydro.cpp(156) : warning C4996: '_splitpath': This function or variable may be unsafe. Consider using _splitpath_s instead. To disable deprecation, use _CRT_SECURE_NO_WARNINGS. See online help for details.
c:\Program Files (x86)\Microsoft Visual Studio 9.0\VC\include\stdlib.h(786) : see declaration of '_splitpath'
.\src\d_hydro.cpp(191) : warning C4996: 'sscanf': This function or variable may be unsafe. Consider using sscanf_s instead. To disable deprecation, use _CRT_SECURE_NO_WARNINGS. See online help for details.
c:\Program Files (x86)\Microsoft Visual Studio 9.0\VC\include\stdio.h(324) : see declaration of 'sscanf'
.\src\d_hydro.cpp(197) : warning C4996: 'fopen': This function or variable may be unsafe. Consider using fopen_s instead. To disable deprecation, use _CRT_SECURE_NO_WARNINGS. See online help for details.
c:\Program Files (x86)\Microsoft Visual Studio 9.0\VC\include\stdio.h(237) : see declaration of 'fopen'
.\src\d_hydro.cpp(240) : warning C4996: 'fopen': This function or variable may be unsafe. Consider using fopen_s instead. To disable deprecation, use _CRT_SECURE_NO_WARNINGS. See online help for details.
c:\Program Files (x86)\Microsoft Visual Studio 9.0\VC\include\stdio.h(237) : see declaration of 'fopen'
.\src\d_hydro.cpp(319) : warning C4995: 'sprintf': name was marked as #pragma deprecated
.\src\d_hydro.cpp(319) : warning C4996: 'sprintf': This function or variable may be unsafe. Consider using sprintf_s instead. To disable deprecation, use _CRT_SECURE_NO_WARNINGS. See online help for details.
c:\Program Files (x86)\Microsoft Visual Studio 9.0\VC\include\stdio.h(366) : see declaration of 'sprintf'
.\src\d_hydro.cpp(335) : warning C4800: 'int' : forcing value to bool 'true' or 'false' (performance warning)
Linking...
Generating code
c:\delft3d_repository\src\utils_lgpl\d_hydro_lib\packages\d_hydro_lib\src\log.cpp(135) : warning C4748: /GS can not protect parameters and local variables from local buffer overrun because optimizations are disabled in function
Finished generating code
Embedding manifest...
Performing Post-Build Event...
oss-install...
Target directory: ..\bin
Source : package/engine d_hydro
1 file(s) copied.
"installing d_hydro . . ."
C:\delft3d_repository\src\engines_gpl\d_hydro\bin\Release\d_hydro.exe -> C:\delft3d_repository\bin\win32\flow2d3d\bin\d_hydro.exe
1 File(s) copied
C:\delft3d_repository\src\third_party_open\tclkit\bin\win32\deltares_hydro.exe -> C:\delft3d_repository\bin\win32\flow2d3d\bin\deltares_hydro.exe
1 File(s) copied
Build log was saved at "file://c:\delft3d_repository\src\engines_gpl\d_hydro\packages\d_hydro\Release\BuildLog.htm"
d_hydro - 0 error(s), 11 warning(s)
------ Build started: Project: test_seq_dlls, Configuration: Release Win32 ------
Compiling with Intel(R) Visual Fortran Compiler XE 13.0.1.119 [IA-32]...
test_seq_dlls_exe.F90
test_seq_dlls.F90
Linking...
ipo: error #11018: Cannot open c:\delft3d_repository\src\engines_gpl\flow2d3d\bin\Release\flow2d3d_openda.lib
LINK : fatal error LNK1181: cannot open input file 'c:\delft3d_repository\src\engines_gpl\flow2d3d\bin\Release\flow2d3d_openda.lib'

Build log written to "file://C:\delft3d_repository\src\third_party_open\openda\tests\test_seq_dlls\Release\BuildLog.htm"
test_seq_dlls - 2 error(s), 0 warning(s)
------ Build started: Project: test_dll_noise, Configuration: Release Win32 ------
Compiling with Intel(R) Visual Fortran Compiler XE 13.0.1.119 [IA-32]...
test_dll_noise.F90
Linking...
ipo: error #11018: Cannot open c:\delft3d_repository\src\engines_gpl\flow2d3d\bin\Release\flow2d3d_openda.lib
LINK : fatal error LNK1181: cannot open input file 'c:\delft3d_repository\src\engines_gpl\flow2d3d\bin\Release\flow2d3d_openda.lib'

Build log written to "file://C:\delft3d_repository\src\third_party_open\openda\tests\test_dll_noise\Release\BuildLog.htm"
test_dll_noise - 2 error(s), 0 warning(s)
------ Build started: Project: mormerge (tools_gpl\mormerge\mormerge), Configuration: Release Win32 ------
Compiling resources...
version_number.rc
Microsoft (R) Windows (R) Resource Compiler Version 6.0.5724.0
Copyright (C) Microsoft Corporation. All rights reserved.
Compiling with Intel(R) Visual Fortran Compiler XE 13.0.1.119 [IA-32]...
mormerge.f90
merge.f90
Linking...
Generating code
Finished generating code
Embedding manifest...
Performing Post-Build Event...
oss-install...
Target directory: ..\bin
Source : package/engine mormerge
1 file(s) copied.
"installing mormerge . . ."
C:\delft3d_repository\src\engines_gpl\flow2d3d\scripts\mormerge.tcl -> C:\delft3d_repository\bin\win32\flow2d3d\scripts\mormerge.tcl
1 File(s) copied
C:\delft3d_repository\src\tools_gpl\mormerge\bin\Release\mormerge.exe -> C:\delft3d_repository\bin\win32\flow2d3d\bin\mormerge.exe
1 File(s) copied

Build log written to "file://C:\delft3d_repository\src\tools_gpl\mormerge\packages\mormerge\Release\BuildLog.txt"
mormerge - 0 error(s), 0 warning(s)
------ Build started: Project: nefis_dll, Configuration: Release Win32 ------
Compiling resources...
Microsoft (R) Windows (R) Resource Compiler Version 6.0.5724.0
Copyright (C) Microsoft Corporation. All rights reserved.
Linking...
Generating code
Finished generating code
Embedding manifest...
Build log was saved at "file://c:\delft3d_repository\src\utils_lgpl\nefis\packages\nefis\Release\BuildLog.htm"
nefis_dll - 0 error(s), 0 warning(s)
------ Build started: Project: nesthd1 (tools_gpl\nesthd1\nesthd1), Configuration: Release Win32 ------
Performing Pre-Build Event...
Generating version number in '.\src\nesthd1_version.F90' ...
..\..\..\..\scripts_lgpl\win32\update_version.cmd: Regenerating existing file '.\src\nesthd1_version.F90'.
Compiling with Intel(R) Visual Fortran Compiler XE 13.0.1.119 [IA-32]...
distance.f90
reargf.f
dattim.f90
gtpoint.f
dimgrd.f
reabnd.f
nearmn.f
getlun.f
zero.f
dimbnd.f
pinpol.f
mkpoint.f
getdim.f
wrista.f
detxy.f
newlun.f90
findmn.f
wrinst.f
C:\delft3d_repository\src\tools_gpl\nesthd1\packages\nesthd1\src\wrinst.f(72): remark #8290: Recommended relationship between field width 'W' and the number of fractional digits 'D' in this edit descriptor is 'W>=D+3'.
detnst.f
inigrd_n.f
files.f
small.f90
detang.f
increm.f
nesthd1_version.F90
nesthd1.f90
avundf.f
memlib.f90
Linking...
deltares_common.lib(cutil.obj) : MSIL .netmodule or module compiled with /GL found; restarting link with /LTCG; add /LTCG to the link command line to improve linker performance
Generating code
Finished generating code
Embedding manifest...

Build log written to "file://C:\delft3d_repository\src\tools_gpl\nesthd1\packages\nesthd1\Release\BuildLog.htm"
nesthd1 - 0 error(s), 0 warning(s)
------ Build started: Project: vs (tools_gpl\vs\vs), Configuration: Release Win32 ------
Performing Pre-Build Event...
A subdirectory or file tmp already exists.
Compiling...
wr.c
vs_y.c
vs_y.c(529) : warning C4102: 'yynewerror' : unreferenced label
vs_l.c
vs_l.c(1546) : warning C4996: 'fileno': The POSIX name for this item is deprecated. Instead, use the ISO C++ conformant name: _fileno. See online help for details.
c:\Program Files (x86)\Microsoft Visual Studio 9.0\VC\include\stdio.h(722) : see declaration of 'fileno'
vr.c
vl.c
viewsel.c
val.c
sm.c
pp.c
pipe.c
intr.c
gr.c
gen.c
.\src\gen.c(273) : warning C4996: 'isatty': The POSIX name for this item is deprecated. Instead, use the ISO C++ conformant name: _isatty. See online help for details.
c:\Program Files (x86)\Microsoft Visual Studio 9.0\VC\include\io.h(312) : see declaration of 'isatty'
fu.c
fm.c
ex.c
el.c
df.c
cl.c
Compiling resources...
Microsoft (R) Windows (R) Resource Compiler Version 6.0.5724.0
Copyright (C) Microsoft Corporation. All rights reserved.
Linking...
Generating code
Finished generating code
Embedding manifest...
Performing Post-Build Event...
oss-install...
Target directory: ..\bin
Source : package/engine vs
1 file(s) copied.
"installing vs . . ."
C:\delft3d_repository\src\tools_gpl\vs\bin\Release\vs.exe -> C:\delft3d_repository\bin\win32\util\bin\vs.exe
1 File(s) copied
Build log was saved at "file://c:\delft3d_repository\src\tools_gpl\vs\packages\vs\Release\BuildLog.htm"
vs - 0 error(s), 3 warning(s)
------ Build started: Project: lint (tools_gpl\lint\lint), Configuration: Release Win32 ------
Compiling...
cl : Command line warning D9035 : option 'Wp64' has been deprecated and will be removed in a future release
main.cpp
Compiling resources...
Microsoft (R) Windows (R) Resource Compiler Version 6.0.5724.0
Copyright (C) Microsoft Corporation. All rights reserved.
Linking...
LINK : fatal error LNK1104: cannot open file 'ifconsol.lib'
Build log was saved at "file://c:\delft3d_repository\src\tools_gpl\lint\packages\lint\Release\BuildLog.htm"
lint - 1 error(s), 1 warning(s)
------ Build started: Project: kubint (tools_gpl\kubint\kubint), Configuration: Release Win32 ------
Compiling...
cl : Command line warning D9035 : option 'Wp64' has been deprecated and will be removed in a future release
main.cpp
Compiling resources...
Microsoft (R) Windows (R) Resource Compiler Version 6.0.5724.0
Copyright (C) Microsoft Corporation. All rights reserved.
Linking...
LINK : fatal error LNK1104: cannot open file 'ifconsol.lib'
Build log was saved at "file://c:\delft3d_repository\src\tools_gpl\kubint\packages\kubint\Release\BuildLog.htm"
kubint - 1 error(s), 1 warning(s)
------ Build started: Project: 02-streamtest, Configuration: Release Win32 ------
Compiling...
cl : Command line warning D9035 : option 'Wp64' has been deprecated and will be removed in a future release
streamtest.cpp
.\streamtest.cpp(126) : warning C4996: 'strcpy': This function or variable may be unsafe. Consider using strcpy_s instead. To disable deprecation, use _CRT_SECURE_NO_WARNINGS. See online help for details.
c:\Program Files (x86)\Microsoft Visual Studio 9.0\VC\include\string.h(74) : see declaration of 'strcpy'
.\streamtest.cpp(269) : warning C4996: 'sprintf': This function or variable may be unsafe. Consider using sprintf_s instead. To disable deprecation, use _CRT_SECURE_NO_WARNINGS. See online help for details.
c:\Program Files (x86)\Microsoft Visual Studio 9.0\VC\include\stdio.h(366) : see declaration of 'sprintf'
.\streamtest.cpp(281) : warning C4996: 'sprintf': This function or variable may be unsafe. Consider using sprintf_s instead. To disable deprecation, use _CRT_SECURE_NO_WARNINGS. See online help for details.
c:\Program Files (x86)\Microsoft Visual Studio 9.0\VC\include\stdio.h(366) : see declaration of 'sprintf'
.\streamtest.cpp(574) : warning C4996: 'vsprintf': This function or variable may be unsafe. Consider using vsprintf_s instead. To disable deprecation, use _CRT_SECURE_NO_WARNINGS. See online help for details.
c:\Program Files (x86)\Microsoft Visual Studio 9.0\VC\include\stdio.h(366) : see declaration of 'vsprintf'
.\streamtest.cpp(599) : warning C4996: 'vsprintf': This function or variable may be unsafe. Consider using vsprintf_s instead. To disable deprecation, use _CRT_SECURE_NO_WARNINGS. See online help for details.
c:\Program Files (x86)\Microsoft Visual Studio 9.0\VC\include\stdio.h(366) : see declaration of 'vsprintf'
Linking...
Generating code
Finished generating code
Embedding manifest...
Build log was saved at "file://c:\delft3d_repository\src\utils_lgpl\stream\tests\02-streamtest\Release\BuildLog.htm"
02-streamtest - 0 error(s), 6 warning(s)
------ Build started: Project: nesthd2 (tools_gpl\nesthd2\nesthd2), Configuration: Release Win32 ------
Performing Pre-Build Event...
Generating version number in '.\src\nesthd2_version.F90' ...
..\..\..\..\scripts_lgpl\win32\update_version.cmd: Regenerating existing file '.\src\nesthd2_version.F90'.
Compiling with Intel(R) Visual Fortran Compiler XE 13.0.1.119 [IA-32]...
nest_hd2.f
wrista.f
files.f
reabnd.f
corcon.f
nefis.f
wrihyd2.f
dimbnd.f
newlun.f90
chkdry.f
hyd2dh.f
wrihyd.f
dethyd.f
check.f90
getwgh.f
wricon2.f
detcon.f
addinp.f
getlun.f
wricon.f
dattim.f90
getdim.f
small.f90
d3stop.f
nesthd2_version.F90
nesthd2.f90
Linking...
deltares_common.lib(cutil.obj) : MSIL .netmodule or module compiled with /GL found; restarting link with /LTCG; add /LTCG to the link command line to improve linker performance
Generating code
Finished generating code
Embedding manifest...

Build log written to "file://C:\delft3d_repository\src\tools_gpl\nesthd2\packages\nesthd2\Release\BuildLog.htm"
nesthd2 - 0 error(s), 0 warning(s)
------ Build started: Project: datsel (tools_gpl\datsel\datsel), Configuration: Release Win32 ------
Compiling...
cl : Command line warning D9035 : option 'Wp64' has been deprecated and will be removed in a future release
main.cpp
Compiling resources...
Microsoft (R) Windows (R) Resource Compiler Version 6.0.5724.0
Copyright (C) Microsoft Corporation. All rights reserved.
Linking...
LINK : fatal error LNK1104: cannot open file 'ifconsol.lib'
Build log was saved at "file://c:\delft3d_repository\src\tools_gpl\datsel\packages\datsel\Release\BuildLog.htm"
datsel - 1 error(s), 1 warning(s)
------ Build started: Project: 01-smalltest, Configuration: Release Win32 ------
Compiling...
cl : Command line warning D9035 : option 'Wp64' has been deprecated and will be removed in a future release
smalltest.cpp
.\smalltest.cpp(66) : warning C4996: 'fopen': This function or variable may be unsafe. Consider using fopen_s instead. To disable deprecation, use _CRT_SECURE_NO_WARNINGS. See online help for details.
c:\Program Files (x86)\Microsoft Visual Studio 9.0\VC\include\stdio.h(237) : see declaration of 'fopen'
.\smalltest.cpp(74) : warning C4996: 'sprintf': This function or variable may be unsafe. Consider using sprintf_s instead. To disable deprecation, use _CRT_SECURE_NO_WARNINGS. See online help for details.
c:\Program Files (x86)\Microsoft Visual Studio 9.0\VC\include\stdio.h(366) : see declaration of 'sprintf'
.\smalltest.cpp(77) : warning C4996: 'sprintf': This function or variable may be unsafe. Consider using sprintf_s instead. To disable deprecation, use _CRT_SECURE_NO_WARNINGS. See online help for details.
c:\Program Files (x86)\Microsoft Visual Studio 9.0\VC\include\stdio.h(366) : see declaration of 'sprintf'
.\smalltest.cpp(80) : warning C4244: 'argument' : conversion from 'double' to 'DWORD', possible loss of data
.\smalltest.cpp(83) : warning C4244: 'argument' : conversion from 'double' to 'DWORD', possible loss of data
.\smalltest.cpp(99) : warning C4996: 'fopen': This function or variable may be unsafe. Consider using fopen_s instead. To disable deprecation, use _CRT_SECURE_NO_WARNINGS. See online help for details.
c:\Program Files (x86)\Microsoft Visual Studio 9.0\VC\include\stdio.h(237) : see declaration of 'fopen'
Linking...
Generating code
Finished generating code
Embedding manifest...
Build log was saved at "file://c:\delft3d_repository\src\utils_lgpl\stream\tests\01-smalltest\Release\BuildLog.htm"
01-smalltest - 0 error(s), 7 warning(s)
========== Build: 56 succeeded, 7 failed, 0 up-to-date, 0 skipped ==========