intro story D-Flow FM

 

D-Flow Flexible Mesh

D-Flow Flexible Mesh (D-Flow FM) is the new software engine for hydrodynamical simulations on unstructured grids in 1D-2D-3D. Together with the familiar curvilinear meshes from Delft3D 4, the unstructured grid can consist of triangles, pentagons (etc.) and 1D channel networks, all in one single mesh. It combines proven technology from the hydrodynamic engines of Delft3D 4 and SOBEK 2 and adds flexible administration, resulting in:

  • Easier 1D-2D-3D model coupling, intuitive setup of boundary conditions and meteorological forcings (amongst others).
  • More flexible 2D gridding in delta regions, river junctions, harbours, intertidal flats and more.
  • High performance by smart use of multicore architectures, and grid computing clusters.
An overview of the current developments can be found here.
 
The D-Flow FM - team would be delighted if you would participate in discussions on the generation of meshes, the specification of boundary conditions, the running of computations, and all kinds of other relevant topics. Feel free to share your smart questions and/or brilliant solutions! 

 

=======================================================
We have launched a new website (still under construction so expect continuous improvements) and a new forum dedicated to Delft3D Flexible Mesh.

Please follow this link to the new forum: 
/web/delft3dfm/forum

Post your questions, issues, suggestions, difficulties related to our Delft3D Flexible Mesh Suite on the new forum.

=======================================================

** PLEASE TAG YOUR POST! **

 

 

Sub groups
D-Flow Flexible Mesh
DELWAQ
Cohesive sediments & muddy systems

 


Message Boards

compile error

NB
Nophi Biton, modified 7 Years ago.

compile error

Padawan Posts: 38 Join Date: 8/1/13 Recent Posts
Hello I am trying to compile the source code for delft3d,

I used Microsoft visual studio 2012 and intel visual fortran 2013 (trial version) for running the .sln.

there seems to be an error on the subversion as the error says

>------ Build started: Project: esmfsm_version_number, Configuration: Release Win32 ------
1> ..\..\..\..\scripts_lgpl\win32\make_revision.bat: Regenerating existing file '.\include\version_number.h'.
1> ..\..\..\..\scripts_lgpl\win32\make_revision.bat: executing C:\Users\Nophi\Desktop\STORM_SURGE\Delft\delft_code\src\third_party_open\subversion\bin\win32\svnversion.exe -n
1> svn: E155021: This client is too old to work with the working copy at
1> 'C:\Users\Nophi\Desktop\STORM_SURGE\Delft\delft_code' (format 31).
1> You need to get a newer Subversion client. For more details, see
1> http://subversion.apache.org/faq.html#working-copy-format-change
1>
1> ..\..\..\..\scripts_lgpl\win32\make_revision.bat: 000000
1> ..\..\..\..\scripts_lgpl\win32\make_revision.bat: executing C:\Users\Nophi\Desktop\STORM_SURGE\Delft\delft_code\src\third_party_open\version_number\bin\win32\version_number.exe 000000 ".\include\version_number.ini" ".\include\version_number.h.svn" ".\include\version_number.h"
1> ..\..\..\..\scripts_lgpl\win32\make_revision.bat: Regenerating existing file '.\include\version_number.rc'.
1> ..\..\..\..\scripts_lgpl\win32\make_revision.bat: executing C:\Users\Nophi\Desktop\STORM_SURGE\Delft\delft_code\src\third_party_open\subversion\bin\win32\svnversion.exe -n
1> svn: E155021: This client is too old to work with the working copy at
1> 'C:\Users\Nophi\Desktop\STORM_SURGE\Delft\delft_code' (format 31).
1> You need to get a newer Subversion client. For more details, see
1> http://subversion.apache.org/faq.html#working-copy-format-change
1>
1> ..\..\..\..\scripts_lgpl\win32\make_revision.bat: 000000
1> ..\..\..\..\scripts_lgpl\win32\make_revision.bat: executing C:\Users\Nophi\Desktop\STORM_SURGE\Delft\delft_code\src\third_party_open\version_number\bin\win32\version_number.exe 000000 ".\include\version_number.ini" ".\include\version_number.rc.svn" ".\include\version_number.rc"
1> c2c.c
1> f2c.c
1> version.c
1> esmfsm_version_number.vcxproj -> C:\Users\Nophi\Desktop\STORM_SURGE\Delft\delft_code\src\utils_lgpl\esmfsm\packages\esmfsm_version_number\bin\Release\esmfsm_version_number.lib
2>------ Build started: Project: esmfsm_c, Configuration: Release Win32 ------
2> esm.cpp
2> esm_f.cpp
2> local.cpp
2>src\esm\local.cpp(196): warning C4244: 'argument' : conversion from '__int64' to 'size_t', possible loss of data
2> shared.cpp
2> fsm.cpp
2> esmfsm_c.vcxproj -> C:\Users\Nophi\Desktop\STORM_SURGE\Delft\delft_code\src\utils_lgpl\esmfsm\packages\esmfsm_c\bin\Release\esmfsm_c.lib
========== Build: 2 succeeded, 0 failed, 0 up-to-date, 0 skipped ==========



pls help me on this matter.

thanks
Adri Mourits, modified 7 Years ago.

RE: compile error (Answer)

Yoda Posts: 1221 Join Date: 1/3/11 Recent Posts
Hi Nophi,

When downloading the Delft3D source code (with SubVersion), you will also download a set of SubVersion binaries. This set is used to detect the revision number of the source code when compiling.

The SubVersion version you have installed on your machine is newer than the SubVersion version downloaded with the Delft3D source code. This causes the error. As a result the revision number can not be detected and 00000 is returned.

But the rest of the (actual) compilation should run fine. You should be able to produce runable binaries. The part of the log you posted ends with "2 succeeded, 0 failed, 0 up-to-date, 0 skipped". If it does not compile, please copy the full output in a textfile and attach that to a post on this forum.

The SubVersion binaries inside the Delft3D source code are updated to SVN version 1.8 in revision 2650.

Regards,

Adri
NB
Nophi Biton, modified 7 Years ago.

RE: compile error

Padawan Posts: 38 Join Date: 8/1/13 Recent Posts
Hi aldri thanks for answering my first question,

I have downloaded a newer version of the code in https://svn.oss.deltares.nl/repos/delft3d/tags/2703

I run the d_hydro_open_source_vs2010_intel13.sln in Microsoft Visual Studio 2012 and Intel visual fortran 2013 (trial)

and Im using tortoiseSVN 1.8.0

my solution configuration is 'Debug'

But there seems to be alot of error during my compilation.

the build error is attached [Build error.txt]

Please do help as I really needed to use and learn this program.

Thanks in Advance

Nophi
Adri Mourits, modified 7 Years ago.

RE: compile error

Yoda Posts: 1221 Join Date: 1/3/11 Recent Posts
Hi Nophi,

Try attaching the build output again.

Regards,

Adri
NB
Nophi Biton, modified 7 Years ago.

RE: compile error

Padawan Posts: 38 Join Date: 8/1/13 Recent Posts
Sorry i can't attach the textfile for some reasons, but anyway here's the error I am getting

2>C:\Program Files\MSBuild\Microsoft.Cpp\v4.0\V110\Microsoft.Cpp.Platform.targets(42,5): error MSB8020: The builds tools for Visual Studio 2010 (Platform Toolset = 'v100') cannot be found. To build using the v100 build tools, either click the Project menu or right-click the solution, and then select "Update VC++ Projects...". Install Visual Studio 2010 to build using the Visual Studio 2010 build tools.
1>C:\Program Files\MSBuild\Microsoft.Cpp\v4.0\V110\Microsoft.Cpp.Platform.targets(42,5): error MSB8020: The builds tools for Visual Studio 2010 (Platform Toolset = 'v100') cannot be found. To build using the v100 build tools, either click the Project menu or right-click the solution, and then select "Update VC++ Projects...". Install Visual Studio 2010 to build using the Visual Studio 2010 build tools.
4>LINK : fatal error LNK1181: cannot open input file 'C:\Users\Nophi\Desktop\STORM_SURGE\Delft\delftcode\src\utils_lgpl\deltares_common\packages\deltares_common_c\bin\Debug\deltares_common_c.lib'
20>LINK : fatal error LNK1181: cannot open input file 'C:\Users\Nophi\Desktop\STORM_SURGE\Delft\delftcode\src\utils_lgpl\delftio\packages\delftio_shm\bin\Debug\delftio_shm.lib'
26>ipo: error #11018: Cannot open C:\Users\Nophi\Desktop\STORM_SURGE\Delft\delftcode\src\utils_lgpl\deltares_common\lib\Debug\static\deltares_common.lib
26>LINK : fatal error LNK1104: cannot open file 'C:\Users\Nophi\Desktop\STORM_SURGE\Delft\delftcode\src\utils_lgpl\deltares_common\lib\Debug\static\deltares_common.lib'
28>Fatal compilation error: Out of memory asking for 69640.
28>compilation aborted for C:\Users\Nophi\Desktop\STORM_SURGE\Delft\delftcode\src\engines_gpl\waq\packages\waq_kernel\src\waq_kernel\dlwq10.f (code 1)
28>chknmr.f
29>Fatal compilation error: Out of memory asking for 2097160.
29>compilation aborted for C:\Users\Nophi\Desktop\STORM_SURGE\Delft\delftcode\src\engines_gpl\flow2d3d\packages\io\src\input\rdwaqpar.f90 (code 1)
29>rdroll.f90
29>Fatal compilation error: Out of memory asking for 36872.
29>compilation aborted for C:\Users\Nophi\Desktop\STORM_SURGE\Delft\delftcode\src\engines_gpl\flow2d3d\packages\io\src\input\rdroll.f90 (code 1)
30>LINK : fatal error LNK1181: cannot open input file 'C:\Users\Nophi\Desktop\STORM_SURGE\Delft\delftcode\src\utils_lgpl\esmfsm\packages\esmfsm_version_number\bin\Debug\esmfsm_version_number.lib'
35>ipo: error #11018: Cannot open C:\Users\Nophi\Desktop\STORM_SURGE\Delft\delftcode\src\utils_lgpl\delftio\lib\Debug\static\delftio.lib
35>ipo: error #11018: Cannot open C:\Users\Nophi\Desktop\STORM_SURGE\Delft\delftcode\src\engines_gpl\waq\packages\waq_utils_c\lib\Debug\waq_utils_c.lib
35>ipo: error #11018: Cannot open C:\Users\Nophi\Desktop\STORM_SURGE\Delft\delftcode\src\engines_gpl\waq\packages\waq_kernel\lib\Debug\waq_kernel.lib
35>ipo: error #11018: Cannot open C:\Users\Nophi\Desktop\STORM_SURGE\Delft\delftcode\src\utils_lgpl\nefis\lib\Debug\static\nefis.lib
35>ipo: error #11018: Cannot open C:\Users\Nophi\Desktop\STORM_SURGE\Delft\delftcode\src\engines_gpl\waq\bin\Debug\waq_plugin_wasteload.lib
35>ipo: error #11018: Cannot open C:\Users\Nophi\Desktop\STORM_SURGE\Delft\delftcode\src\engines_gpl\waq\packages\delwaq2_version_number\lib\Debug\delwaq2_version_number.lib
35>ipo: error #11018: Cannot open C:\Users\Nophi\Desktop\STORM_SURGE\Delft\delftcode\src\utils_lgpl\esmfsm\lib\Debug\static\esmfsm.lib
35>ipo: error #11018: Cannot open C:\Users\Nophi\Desktop\STORM_SURGE\Delft\delftcode\src\utils_lgpl\deltares_common\lib\Debug\static\deltares_common.lib
35>LINK : fatal error LNK1181: cannot open input file 'C:\Users\Nophi\Desktop\STORM_SURGE\Delft\delftcode\src\utils_lgpl\delftio\lib\Debug\static\delftio.lib'
37>C:\Users\Nophi\Desktop\STORM_SURGE\Delft\delftcode\src\engines_gpl\flow2d3d\packages\kernel\src\inichk\d3d_in_openda.f90(74): error #7002: Error in opening the compiled module file. Check INCLUDE paths. [D3D_OLV_CLASS]
37>C:\Users\Nophi\Desktop\STORM_SURGE\Delft\delftcode\src\engines_gpl\flow2d3d\packages\kernel\src\inichk\d3d_in_openda.f90(76): error #6457: This derived type name has not been declared. [OLVHANDLE]
44>C:\Program Files\MSBuild\Microsoft.Cpp\v4.0\V110\Microsoft.Cpp.Platform.targets(42,5): error MSB8020: The builds tools for Visual Studio 2010 (Platform Toolset = 'v100') cannot be found. To build using the v100 build tools, either click the Project menu or right-click the solution, and then select "Update VC++ Projects...". Install Visual Studio 2010 to build using the Visual Studio 2010 build tools.
45>------ Build started: Project: mormerge_version_number (Visual Studio 2010), Configuration: Debug Win32 ------
37>getfixfac.f90
45>C:\Program Files\MSBuild\Microsoft.Cpp\v4.0\V110\Microsoft.Cpp.Platform.targets(42,5): error MSB8020: The builds tools for Visual Studio 2010 (Platform Toolset = 'v100') cannot be found. To build using the v100 build tools, either click the Project menu or right-click the solution, and then select "Update VC++ Projects...". Install Visual Studio 2010 to build using the Visual Studio 2010 build tools.
46>ipo: error #11018: Cannot open C:\Users\Nophi\Desktop\STORM_SURGE\Delft\delftcode\src\engines_gpl\waq\packages\waq_kernel\lib\Debug\waq_kernel.lib
46>ipo: error #11018: Cannot open C:\Users\Nophi\Desktop\STORM_SURGE\Delft\delftcode\src\utils_lgpl\nefis\lib\Debug\static\nefis.lib
46>ipo: error #11018: Cannot open C:\Users\Nophi\Desktop\STORM_SURGE\Delft\delftcode\src\engines_gpl\waq\packages\delwaq1_version_number\lib\Debug\delwaq1_version_number.lib
46>ipo: error #11018: Cannot open C:\Users\Nophi\Desktop\STORM_SURGE\Delft\delftcode\src\utils_lgpl\deltares_common\lib\Debug\static\deltares_common.lib
46>LINK : fatal error LNK1181: cannot open input file 'C:\Users\Nophi\Desktop\STORM_SURGE\Delft\delftcode\src\engines_gpl\waq\packages\waq_kernel\lib\Debug\waq_kernel.lib'
50>ipo: error #11018: Cannot open pthreadVCE2.lib
50>ipo: error #11018: Cannot open C:\Users\Nophi\Desktop\STORM_SURGE\Delft\delftcode\src\utils_lgpl\delftio\lib\Debug\static\delftio.lib
50>ipo: error #11018: Cannot open C:\Users\Nophi\Desktop\STORM_SURGE\Delft\delftcode\src\engines_gpl\waq\packages\waq_utils_c\lib\Debug\waq_utils_c.lib
50>ipo: error #11018: Cannot open C:\Users\Nophi\Desktop\STORM_SURGE\Delft\delftcode\src\engines_gpl\waq\packages\waq_kernel\lib\Debug\waq_kernel.lib
50>ipo: error #11018: Cannot open C:\Users\Nophi\Desktop\STORM_SURGE\Delft\delftcode\src\utils_lgpl\nefis\lib\Debug\static\nefis.lib
50>ipo: error #11018: Cannot open C:\Users\Nophi\Desktop\STORM_SURGE\Delft\delftcode\src\engines_gpl\waq\bin\Debug\waq_plugin_wasteload.lib
50>ipo: error #11018: Cannot open C:\Users\Nophi\Desktop\STORM_SURGE\Delft\delftcode\src\engines_gpl\waq\packages\delwaq2_version_number\lib\Debug\delwaq2_version_number.lib
50>ipo: error #11018: Cannot open C:\Users\Nophi\Desktop\STORM_SURGE\Delft\delftcode\src\utils_lgpl\esmfsm\lib\Debug\static\esmfsm.lib
50>ipo: error #11018: Cannot open C:\Users\Nophi\Desktop\STORM_SURGE\Delft\delftcode\src\utils_lgpl\deltares_common\lib\Debug\static\deltares_common.lib
50>ipo: warning #11077: C:\Users\Nophi\Desktop\STORM_SURGE\Delft\delftcode\src\engines_gpl\waq\packages\delwaq2_openda_lib\Debug\waq_omi_substances.obj: locally defined symbol __imp__DEFINEWQPROCESSES imported
50>ipo: warning #11077: C:\Users\Nophi\Desktop\STORM_SURGE\Delft\delftcode\src\engines_gpl\waq\packages\delwaq2_openda_lib\Debug\waq_omi_substances.obj: locally defined symbol __imp__SETCURRENTVALUESCALARRUN imported
50>ipo: warning #11077: C:\Users\Nophi\Desktop\STORM_SURGE\Delft\delftcode\src\engines_gpl\waq\packages\delwaq2_openda_lib\Debug\waq_omi_lib.obj: locally defined symbol __imp__DLWQMAIN imported
50>LINK : fatal error LNK1181: cannot open input file 'pthreadVCE2.lib'
52>C:\Program Files\MSBuild\Microsoft.Cpp\v4.0\V110\Microsoft.Cpp.Platform.targets(42,5): error MSB8020: The builds tools for Visual Studio 2010 (Platform Toolset = 'v100') cannot be found. To build using the v100 build tools, either click the Project menu or right-click the solution, and then select "Update VC++ Projects...". Install Visual Studio 2010 to build using the Visual Studio 2010 build tools.
53>fatal error RC1110: could not open C:\Users\Nophi\Desktop\STORM_SURGE\Delft\delftcode\src\tools_gpl\mormerge\packages\mormerge_version_number\include\version_number.rc
57>ipo: error #11018: Cannot open ..\..\..\..\third_party_open\pthreads\bin\win32\pthreadvce2.lib
57>ipo: error #11018: Cannot open C:\Users\Nophi\Desktop\STORM_SURGE\Delft\delftcode\src\utils_lgpl\esmfsm\lib\Debug\static\esmfsm.lib
57>ipo: error #11018: Cannot open C:\Users\Nophi\Desktop\STORM_SURGE\Delft\delftcode\src\utils_lgpl\deltares_common\lib\Debug\static\deltares_common.lib
57>LINK : fatal error LNK1181: cannot open input file '..\..\..\..\third_party_open\pthreads\bin\win32\pthreadvce2.lib'
58>ipo: error #11018: Cannot open C:\Users\Nophi\Desktop\STORM_SURGE\Delft\delftcode\src\utils_lgpl\nefis\lib\Debug\static\nefis.lib
58>ipo: error #11018: Cannot open C:\Users\Nophi\Desktop\STORM_SURGE\Delft\delftcode\src\utils_lgpl\deltares_common\lib\Debug\static\deltares_common.lib
58>LINK : fatal error LNK1181: cannot open input file 'C:\Users\Nophi\Desktop\STORM_SURGE\Delft\delftcode\src\utils_lgpl\nefis\lib\Debug\static\nefis.lib'
59>fatal error RC1110: could not open C:\Users\Nophi\Desktop\STORM_SURGE\Delft\delftcode\src\engines_gpl\waq\packages\delwaq1_version_number\include\version_number.rc
62>ipo: error #11018: Cannot open C:\Users\Nophi\Desktop\STORM_SURGE\Delft\delftcode\src\engines_gpl\waq\bin\Debug\delwaq2_lib.lib
62>ipo: error #11018: Cannot open C:\Users\Nophi\Desktop\STORM_SURGE\Delft\delftcode\src\engines_gpl\waq\bin\Debug\delwaq2_openda_lib.lib
62>LINK : fatal error LNK1181: cannot open input file 'C:\Users\Nophi\Desktop\STORM_SURGE\Delft\delftcode\src\engines_gpl\waq\bin\Debug\delwaq2_lib.lib'
63>ipo: error #11018: Cannot open C:\Users\Nophi\Desktop\STORM_SURGE\Delft\delftcode\src\engines_gpl\waq\packages\waq_kernel\lib\Debug\waq_kernel.lib
63>ipo: error #11018: Cannot open C:\Users\Nophi\Desktop\STORM_SURGE\Delft\delftcode\src\engines_gpl\waq\bin\Debug\delwaq2_openda_lib.lib
63>ipo: error #11018: Cannot open C:\Users\Nophi\Desktop\STORM_SURGE\Delft\delftcode\src\utils_lgpl\deltares_common\lib\Debug\static\deltares_common.lib
63>LINK : fatal error LNK1181: cannot open input file 'C:\Users\Nophi\Desktop\STORM_SURGE\Delft\delftcode\src\engines_gpl\waq\packages\waq_kernel\lib\Debug\waq_kernel.lib'
64>ipo: error #11018: Cannot open pthreadVCE2.lib
64>ipo: error #11018: Cannot open C:\Users\Nophi\Desktop\STORM_SURGE\Delft\delftcode\src\engines_gpl\waq\bin\Debug\delwaq2_lib.lib
64>ipo: error #11018: Cannot open C:\Users\Nophi\Desktop\STORM_SURGE\Delft\delftcode\src\engines_gpl\waq\bin\Debug\waq_plugin_wasteload.lib
64>LINK : fatal error LNK1181: cannot open input file 'pthreadVCE2.lib'
65>ipo: error #11018: Cannot open C:\Users\Nophi\Desktop\STORM_SURGE\Delft\delftcode\src\utils_lgpl\delftio\lib\Debug\static\delftio.lib
65>ipo: error #11018: Cannot open C:\Users\Nophi\Desktop\STORM_SURGE\Delft\delftcode\src\engines_gpl\waq\packages\waq_kernel\lib\Debug\waq_kernel.lib
65>ipo: error #11018: Cannot open C:\Users\Nophi\Desktop\STORM_SURGE\Delft\delftcode\src\utils_lgpl\deltares_common\lib\Debug\static\deltares_common.lib
65>LINK : fatal error LNK1181: cannot open input file 'C:\Users\Nophi\Desktop\STORM_SURGE\Delft\delftcode\src\utils_lgpl\delftio\lib\Debug\static\delftio.lib'
66>ipo: error #11018: Cannot open C:\Users\Nophi\Desktop\STORM_SURGE\Delft\delftcode\src\engines_gpl\waq\bin\Debug\delwaq2_lib.lib
66>ipo: error #11018: Cannot open C:\Users\Nophi\Desktop\STORM_SURGE\Delft\delftcode\src\utils_lgpl\delftio\lib\Debug\static\delftio.lib
66>ipo: error #11018: Cannot open C:\Users\Nophi\Desktop\STORM_SURGE\Delft\delftcode\src\engines_gpl\waq\packages\waq_kernel\lib\Debug\waq_kernel.lib
66>ipo: error #11018: Cannot open C:\Users\Nophi\Desktop\STORM_SURGE\Delft\delftcode\src\engines_gpl\waq\packages\delwaq2_version_number\lib\Debug\delwaq2_version_number.lib
66>ipo: error #11018: Cannot open C:\Users\Nophi\Desktop\STORM_SURGE\Delft\delftcode\src\utils_lgpl\deltares_common\lib\Debug\static\deltares_common.lib
66>LINK : fatal error LNK1181: cannot open input file 'C:\Users\Nophi\Desktop\STORM_SURGE\Delft\delftcode\src\engines_gpl\waq\bin\Debug\delwaq2_lib.lib'
67>ipo: error #11018: Cannot open C:\Users\Nophi\Desktop\STORM_SURGE\Delft\delftcode\src\engines_gpl\waq\bin\Debug\delwaq2_lib.lib
67>LINK : fatal error LNK1181: cannot open input file 'C:\Users\Nophi\Desktop\STORM_SURGE\Delft\delftcode\src\engines_gpl\waq\bin\Debug\delwaq2_lib.lib'
68>ipo: error #11018: Cannot open C:\Users\Nophi\Desktop\STORM_SURGE\Delft\delftcode\src\engines_gpl\waq\bin\Debug\delwaq2_lib.lib
68>LINK : fatal error LNK1181: cannot open input file 'C:\Users\Nophi\Desktop\STORM_SURGE\Delft\delftcode\src\engines_gpl\waq\bin\Debug\delwaq2_lib.lib'
69>ipo: error #11018: Cannot open C:\Users\Nophi\Desktop\STORM_SURGE\Delft\delftcode\src\engines_gpl\waq\packages\waq_kernel\lib\Debug\waq_kernel.lib
69>ipo: error #11018: Cannot open C:\Users\Nophi\Desktop\STORM_SURGE\Delft\delftcode\src\engines_gpl\waq\bin\Debug\delwaq2_openda_lib.lib
69>ipo: error #11018: Cannot open C:\Users\Nophi\Desktop\STORM_SURGE\Delft\delftcode\src\utils_lgpl\deltares_common\lib\Debug\static\deltares_common.lib
69>LINK : fatal error LNK1181: cannot open input file 'C:\Users\Nophi\Desktop\STORM_SURGE\Delft\delftcode\src\engines_gpl\waq\packages\waq_kernel\lib\Debug\waq_kernel.lib'
70>ipo: error #11018: Cannot open C:\Users\Nophi\Desktop\STORM_SURGE\Delft\delftcode\src\engines_gpl\waq\packages\waq_kernel\lib\Debug\waq_kernel.lib
70>ipo: error #11018: Cannot open C:\Users\Nophi\Desktop\STORM_SURGE\Delft\delftcode\src\tools_gpl\waq_run_processes\packages\waq_run_processes_version_number\bin\Debug\waq_run_processes_version_number.lib
70>ipo: error #11018: Cannot open C:\Users\Nophi\Desktop\STORM_SURGE\Delft\delftcode\src\utils_lgpl\deltares_common\lib\Debug\static\deltares_common.lib
70>LINK : fatal error LNK1181: cannot open input file 'C:\Users\Nophi\Desktop\STORM_SURGE\Delft\delftcode\src\engines_gpl\waq\packages\waq_kernel\lib\Debug\waq_kernel.lib'
72>ipo: error #11018: Cannot open C:\Users\Nophi\Desktop\STORM_SURGE\Delft\delftcode\src\utils_lgpl\nefis\lib\Debug\static\nefis.lib
72>ipo: error #11018: Cannot open C:\Users\Nophi\Desktop\STORM_SURGE\Delft\delftcode\src\utils_lgpl\deltares_common\lib\Debug\static\deltares_common.lib
72>LINK : fatal error LNK1181: cannot open input file 'C:\Users\Nophi\Desktop\STORM_SURGE\Delft\delftcode\src\utils_lgpl\nefis\lib\Debug\static\nefis.lib'
75>ipo: error #11018: Cannot open C:\Users\Nophi\Desktop\STORM_SURGE\Delft\delftcode\src\utils_lgpl\delftio\lib\Debug\static\delftio.lib
75>ipo: error #11018: Cannot open C:\Users\Nophi\Desktop\STORM_SURGE\Delft\delftcode\src\utils_lgpl\nefis\lib\Debug\static\nefis.lib
75>ipo: error #11018: Cannot open C:\Users\Nophi\Desktop\STORM_SURGE\Delft\delftcode\src\utils_lgpl\deltares_common\lib\Debug\static\deltares_common.lib
75>LINK : fatal error LNK1181: cannot open input file 'C:\Users\Nophi\Desktop\STORM_SURGE\Delft\delftcode\src\utils_lgpl\delftio\lib\Debug\static\delftio.lib'
79>C:\Users\Nophi\Desktop\STORM_SURGE\Delft\delftcode\src\engines_gpl\flow2d3d\packages\flow2d3d_openda\src\flow2d3d_f.f90(40): error #7002: Error in opening the compiled module file. Check INCLUDE paths. [M_OPENDA_OLV]
79>C:\Users\Nophi\Desktop\STORM_SURGE\Delft\delftcode\src\engines_gpl\flow2d3d\packages\flow2d3d_openda\src\flow2d3d_f.f90(100): error #6404: This name does not have a type, and must have an explicit type. [OPENDA_OLV_HANDLE]
79>C:\Users\Nophi\Desktop\STORM_SURGE\Delft\delftcode\src\engines_gpl\flow2d3d\packages\flow2d3d_openda\src\flow2d3d_f.f90(198): error #7002: Error in opening the compiled module file. Check INCLUDE paths. [M_OPENDA_OLV]
79>C:\Users\Nophi\Desktop\STORM_SURGE\Delft\delftcode\src\engines_gpl\flow2d3d\packages\flow2d3d_openda\src\flow2d3d_f.f90(225): error #6404: This name does not have a type, and must have an explicit type. [OPENDA_OLV_HANDLE]
79>C:\Users\Nophi\Desktop\STORM_SURGE\Delft\delftcode\src\engines_gpl\flow2d3d\packages\flow2d3d_openda\src\flow2d3d_f.f90(237): error #7002: Error in opening the compiled module file. Check INCLUDE paths. [M_OPENDA_OLV]
79>C:\Users\Nophi\Desktop\STORM_SURGE\Delft\delftcode\src\engines_gpl\flow2d3d\packages\flow2d3d_openda\src\flow2d3d_f.f90(250): error #6404: This name does not have a type, and must have an explicit type. [OPENDA_OLV_HANDLE]
Adri Mourits, modified 7 Years ago.

RE: compile error (Answer)

Yoda Posts: 1221 Join Date: 1/3/11 Recent Posts
Hi Nophi,

The problems seem to be related to MSBuild. I added an item to the FAQ.

Regards,

Adri
NB
Nophi Biton, modified 7 Years ago.

RE: compile error

Padawan Posts: 38 Join Date: 8/1/13 Recent Posts
Hello Aldri,

Is it advisable to update the .sln to be compatible to VS 2012 (as this being asked when I open the .sln)? would this alter something in the code?

as I can see in the Build error is MSBuild.exe all contributing to the error cause most error are "IPO error #" (what is this?).

Im still figuring out how to disable MSbuild.exe.

Thanks in advance,

Nophi
Qinghua Ye, modified 7 Years ago.

RE: compile error

Jedi Council Member Posts: 612 Join Date: 3/2/11 Recent Posts
Hi Nophi,

To update to the VS 2012 is on our todo list. But I won't expect that to be done soon (i.e. before Sept, Oct). Maybe you can try to update that by yourself? We could provide some help in that case...

Regards,

Qinghua
NB
Nophi Biton, modified 7 Years ago.

RE: compile error

Padawan Posts: 38 Join Date: 8/1/13 Recent Posts
Ok Thank you Qinghua,

I tried to update it as VS2012 prompts every opening of the solution file.

from the 50 errors back onto my first try to compile its now down to 13 errors.

the error seems to be finding something about "pthread.h" (as it cannot find the directory for it)

and also it cannot open the file "pthreadVCE2.lib", so I tried to search for the directory (as advised by Aldri in some other thread) and indeed the whole pthread folder is not located in the stated directory "...\src\third_party_open\" (how do I correct this?)

and for my question is this (pthreadVCE2.lib) needed if I only need to run for Delft3d-FLOW for storm surge simulation??

regards

Nophi