Home_intro

intro story DELWAQ

DELWAQ

DELWAQ is the engine of the D-Water Quality and D-Ecology programmes of the Delft3D suite. It is based on a rich library from which relevant substances and processes can be selected to quickly put water and sediment quality models together.

The processes library covers many aspects of water quality and ecology, from basic tracers, dissolved oxygen, nutrients, organic matter, inorganic suspended matter, heavy metals, bacteria and organic micro-pollutants, to complex algae and macrophyte dynamics. High performance solvers enable the simulation of long periods, often required to capture the full cycles of the processes being modelled.

The finite volume approach underlying DELWAQ allows it to be coupled to both the structured grid hydrodynamics of the current Delft3D-FLOW engine and the upcoming D-Flow Flexible Mesh engine (1D-2D-3D) of the Delft3D Flexible Mesh Suite (or even other models such as TELEMAC).

'DELWAQ in open source' is our invitation to all leading experts to collaborate in further development and research in the field of water quality, ecology and morphology using Delft3D. Feel free to post your DELWAQ related questions or comments in this dedicated forum space. If you are new to DELWAQ, the tutorial (in the user manual) is a good place to start. A list of DELWAQ related publications is available here.

** PLEASE TAG YOUR POST! **

 

 

Sub groups
D-Flow Flexible Mesh
DELWAQ

Cohesive sediments & muddy systems

 


Message Boards

Trouble compiling in Windows

U
Ashmita Sengupta, modified 5 Years ago.

Trouble compiling in Windows

I'm having issues compiling in VS 2013 Here is the output from the build.
Any insight would be appreciated.
Thanks!

1>------ Build started: Project: nefis_dll, Configuration: Release Win32 ------
2>------ Build started: Project: datsel_version_number, Configuration: Release Win32 ------
1>C:\Program Files (x86)\MSBuild\Microsoft.Cpp\v4.0\V120\Microsoft.CppBuild.targets(388,5): warning MSB8028: The intermediate directory (Release\) contains files shared from another project (nefis.vcxproj). This can lead to incorrect clean and rebuild behavior.
3>------ Build started: Project: kubint_version_number, Configuration: Release Win32 ------
4>------ Build started: Project: part_version_number, Configuration: Release Win32 ------
1> Generating version number in '.\include\nefis_version.h' ...
1> ..\..\..\..\scripts_lgpl\win32\update_version.cmd: 000000
1> ..\..\..\..\scripts_lgpl\win32\update_version.cmd: Regenerating existing file '.\include\nefis_version.h'.
3> Generating version number in '.\include\version_number.h' ...
2> Generating version number in '.\include\version_number.h' ...
4> Generating version number in '.\include\version_number.h' ...
2> ..\..\..\..\scripts_lgpl\win32\update_version.cmd: 000000
2> ..\..\..\..\scripts_lgpl\win32\update_version.cmd: Regenerating existing file '.\include\version_number.h'.
3> ..\..\..\..\scripts_lgpl\win32\update_version.cmd: 000000
3> ..\..\..\..\scripts_lgpl\win32\update_version.cmd: Regenerating existing file '.\include\version_number.h'.
4> ..\..\..\..\scripts_lgpl\win32\update_version.cmd: 000000
1> Generating version number in '.\include\nefis_version.rc' ...
4> ..\..\..\..\scripts_lgpl\win32\update_version.cmd: Regenerating existing file '.\include\version_number.h'.
3> Generating version number in '.\include\version_number.rc' ...
2> Generating version number in '.\include\version_number.rc' ...
4> Generating version number in '.\include\version_number.rc' ...
1> ..\..\..\..\scripts_lgpl\win32\update_version.cmd: 000000
1> ..\..\..\..\scripts_lgpl\win32\update_version.cmd: Regenerating existing file '.\include\nefis_version.rc'.
3> ..\..\..\..\scripts_lgpl\win32\update_version.cmd: 000000
3> ..\..\..\..\scripts_lgpl\win32\update_version.cmd: Regenerating existing file '.\include\version_number.rc'.
4> ..\..\..\..\scripts_lgpl\win32\update_version.cmd: 000000
4> ..\..\..\..\scripts_lgpl\win32\update_version.cmd: Regenerating existing file '.\include\version_number.rc'.
2> ..\..\..\..\scripts_lgpl\win32\update_version.cmd: 000000
2> ..\..\..\..\scripts_lgpl\win32\update_version.cmd: Regenerating existing file '.\include\version_number.rc'.
3> c2c.c
4> c2c.c
2> c2c.c
1> c2c.c
4> f2c.c
3> f2c.c
2> f2c.c
1>src\c2c.c(923): warning C4018: '<' : signed/unsigned mismatch
1>src\c2c.c(983): warning C4018: '<' : signed/unsigned mismatch
1> df.c
4> version.c
3> version.c
2> version.c
1> er.c
3> kubint_version_number.vcxproj -> C:\Delft\Wave\releases\4440\src\tools_gpl\kubint\packages\kubint_version_number\bin\Release\kubint_version_number.lib
2> datsel_version_number.vcxproj -> C:\Delft\Wave\releases\4440\src\tools_gpl\datsel\packages\datsel_version_number\bin\Release\datsel_version_number.lib
4> part_version_number.vcxproj -> C:\Delft\Wave\releases\4440\src\engines_gpl\part\packages\version_number\Release\part_version_number.lib
1> f2c.c
5>------ Build started: Project: lint_version_number, Configuration: Release Win32 ------
6>------ Build started: Project: kubint_intel13, Configuration: Release Win32 ------
7>------ Build started: Project: 02-streamtest, Configuration: Release Win32 ------
6>C:\Program Files (x86)\MSBuild\Microsoft.Cpp\v4.0\V120\Microsoft.Cpp.Platform.targets(64,5): error MSB8020: The build tools for Visual Studio 2010 (Platform Toolset = 'v100') cannot be found. To build using the v100 build tools, please install Visual Studio 2010 build tools. Alternatively, you may upgrade to the current Visual Studio tools by selecting the Project menu or right-click the solution, and then selecting "Upgrade Solution...".
7> streamtest.cpp
5> Generating version number in '.\include\version_number.h' ...
1> hs.c
5> ..\..\..\..\scripts_lgpl\win32\update_version.cmd: 000000
5> ..\..\..\..\scripts_lgpl\win32\update_version.cmd: Regenerating existing file '.\include\version_number.h'.
5> Generating version number in '.\include\version_number.rc' ...
5> ..\..\..\..\scripts_lgpl\win32\update_version.cmd: 000000
5> ..\..\..\..\scripts_lgpl\win32\update_version.cmd: Regenerating existing file '.\include\version_number.rc'.
8>------ Build started: Project: mormerge_version_number, Configuration: Release Win32 ------
8> Generating version number in '.\include\version_number.h' ...
8> ..\..\..\..\scripts_lgpl\win32\update_version.cmd: 000000
8> ..\..\..\..\scripts_lgpl\win32\update_version.cmd: Regenerating existing file '.\include\version_number.h'.
8> Generating version number in '.\include\version_number.rc' ...
8> ..\..\..\..\scripts_lgpl\win32\update_version.cmd: 000000
8> ..\..\..\..\scripts_lgpl\win32\update_version.cmd: Regenerating existing file '.\include\version_number.rc'.
8> c2c.c
7>streamtest.cpp(49): fatal error C1083: Cannot open include file: 'atltime.h': No such file or directory
5> c2c.c
1>src\hs.c(353): warning C4244: '=' : conversion from 'BUInt8' to 'BInt4', possible loss of data
1> oc.c
5> f2c.c
1>src\oc.c(74): warning C4005: 'FILE_READ_ONLY' : macro redefinition
1> C:\Program Files (x86)\Windows Kits\8.1\Include\um\winbase.h(2517) : see previous definition of 'FILE_READ_ONLY'
5> version.c
8> f2c.c
9>------ Build started: Project: d_hydro (engines_gpl\d_hydro\d_hydro), Configuration: Release Win32 ------
1> nefis_version.cpp
9> Generating version number in '.\include\d_hydro_version.h' ...
9> ..\..\..\..\scripts_lgpl\win32\update_version.cmd: 000000
9> ..\..\..\..\scripts_lgpl\win32\update_version.cmd: Regenerating existing file '.\include\d_hydro_version.h'.
8> version.c
9> d_hydro.cpp
5> lint_version_number.vcxproj -> C:\Delft\Wave\releases\4440\src\tools_gpl\lint\packages\lint_version_number\bin\Release\lint_version_number.lib
10>------ Build started: Project: lint_intel13, Configuration: Release Win32 ------
1>include\nefis_version.rc(10): fatal error RC1015: cannot open include file 'afxres.h'.
1>
8> mormerge_version_number.vcxproj -> C:\Delft\Wave\releases\4440\src\tools_gpl\mormerge\packages\mormerge_version_number\lib/Release\mormerge_version_number.lib
10>C:\Program Files (x86)\MSBuild\Microsoft.Cpp\v4.0\V120\Microsoft.Cpp.Platform.targets(64,5): error MSB8020: The build tools for Visual Studio 2010 (Platform Toolset = 'v100') cannot be found. To build using the v100 build tools, please install Visual Studio 2010 build tools. Alternatively, you may upgrade to the current Visual Studio tools by selecting the Project menu or right-click the solution, and then selecting "Upgrade Solution...".
11>------ Build started: Project: nefis (utils_lgpl\nefis\nefis), Configuration: Release Win32 ------
12>------ Build started: Project: delwaq1_version_number, Configuration: Release Win32 ------
11>C:\Program Files (x86)\MSBuild\Microsoft.Cpp\v4.0\V120\Microsoft.CppBuild.targets(388,5): warning MSB8028: The intermediate directory (Release\) contains files shared from another project (nefis_dll.vcxproj). This can lead to incorrect clean and rebuild behavior.
11> Generating version number in '.\include\nefis_version.h' ...
12> Generating version number in '.\include\version_number.h' ...
11> ..\..\..\..\scripts_lgpl\win32\update_version.cmd: 000000
11> ..\..\..\..\scripts_lgpl\win32\update_version.cmd: Regenerating existing file '.\include\nefis_version.h'.
12> ..\..\..\..\scripts_lgpl\win32\update_version.cmd: 000000
12> ..\..\..\..\scripts_lgpl\win32\update_version.cmd: Regenerating existing file '.\include\version_number.h'.
13>------ Build started: Project: delwaq2_version_number, Configuration: Release Win32 ------
11> Generating version number in '.\include\nefis_version.rc' ...
12> Generating version number in '.\include\version_number.rc' ...
11> ..\..\..\..\scripts_lgpl\win32\update_version.cmd: 000000
11> ..\..\..\..\scripts_lgpl\win32\update_version.cmd: Regenerating existing file '.\include\nefis_version.rc'.
12> ..\..\..\..\scripts_lgpl\win32\update_version.cmd: 000000
12> ..\..\..\..\scripts_lgpl\win32\update_version.cmd: Regenerating existing file '.\include\version_number.rc'.
11> c2c.c
12> c2c.c
11>C:\Program Files (x86)\Microsoft Visual Studio 12.0\VC\include\string.h(121): warning C4391: 'size_t strlen(const char *)' : incorrect return type for intrinsic function, expected 'unsigned int'
11>C:\Program Files (x86)\Microsoft Visual Studio 12.0\VC\include\string.h(296): warning C4391: 'size_t wcslen(const wchar_t *)' : incorrect return type for intrinsic function, expected 'unsigned int'
11>C:\Program Files (x86)\Windows Kits\8.1\Include\um\winnt.h(17546): error C2146: syntax error : missing ')' before identifier 'ListHead'
11>C:\Program Files (x86)\Windows Kits\8.1\Include\um\winnt.h(17546): error C2061: syntax error : identifier 'ListHead'
11>C:\Program Files (x86)\Windows Kits\8.1\Include\um\winnt.h(17546): error C2059: syntax error : ';'
11>C:\Program Files (x86)\Windows Kits\8.1\Include\um\winnt.h(17547): error C2059: syntax error : ')'
11>C:\Program Files (x86)\Windows Kits\8.1\Include\um\winnt.h(17554): error C2143: syntax error : missing ')' before '*'
11>C:\Program Files (x86)\Windows Kits\8.1\Include\um\winnt.h(17554): error C2143: syntax error : missing '{' before '*'
11>C:\Program Files (x86)\Windows Kits\8.1\Include\um\winnt.h(17555): error C2059: syntax error : ')'
11>C:\Program Files (x86)\Windows Kits\8.1\Include\um\winnt.h(17561): error C2146: syntax error : missing ')' before identifier 'ListHead'
11>C:\Program Files (x86)\Windows Kits\8.1\Include\um\winnt.h(17561): error C2061: syntax error : identifier 'ListHead'
11>C:\Program Files (x86)\Windows Kits\8.1\Include\um\winnt.h(17561): error C2059: syntax error : ';'
11>C:\Program Files (x86)\Windows Kits\8.1\Include\um\winnt.h(17562): error C2059: syntax error : ')'
11>C:\Program Files (x86)\Windows Kits\8.1\Include\um\winnt.h(17568): error C2146: syntax error : missing ')' before identifier 'ListHead'
11>C:\Program Files (x86)\Windows Kits\8.1\Include\um\winnt.h(17568): error C2061: syntax error : identifier 'ListHead'
11>C:\Program Files (x86)\Windows Kits\8.1\Include\um\winnt.h(17568): error C2059: syntax error : ';'
11>C:\Program Files (x86)\Windows Kits\8.1\Include\um\winnt.h(17568): error C2059: syntax error : ','
11>C:\Program Files (x86)\Windows Kits\8.1\Include\um\winnt.h(17570): error C2059: syntax error : ')'
11>C:\Program Files (x86)\Windows Kits\8.1\Include\um\winnt.h(17576): error C2146: syntax error : missing ')' before identifier 'ListHead'
11>C:\Program Files (x86)\Windows Kits\8.1\Include\um\winnt.h(17576): error C2061: syntax error : identifier 'ListHead'
11>C:\Program Files (x86)\Windows Kits\8.1\Include\um\winnt.h(17576): error C2059: syntax error : ';'
11>C:\Program Files (x86)\Windows Kits\8.1\Include\um\winnt.h(17576): error C2059: syntax error : ','
11>C:\Program Files (x86)\Windows Kits\8.1\Include\um\winnt.h(17580): error C2059: syntax error : ')'
11>C:\Program Files (x86)\Windows Kits\8.1\Include\um\winnt.h(17586): error C2146: syntax error : missing ')' before identifier 'ListHead'
11>C:\Program Files (x86)\Windows Kits\8.1\Include\um\winnt.h(17586): error C2061: syntax error : identifier 'ListHead'
11>C:\Program Files (x86)\Windows Kits\8.1\Include\um\winnt.h(17586): error C2059: syntax error : ';'
11>C:\Program Files (x86)\Windows Kits\8.1\Include\um\winnt.h(17587): error C2059: syntax error : ')'
11>C:\Program Files (x86)\Windows Kits\8.1\Include\um\winnt.h(17593): error C2146: syntax error : missing ')' before identifier 'ListHead'
11>C:\Program Files (x86)\Windows Kits\8.1\Include\um\winnt.h(17593): error C2061: syntax error : identifier 'ListHead'
11>C:\Program Files (x86)\Windows Kits\8.1\Include\um\winnt.h(17593): error C2059: syntax error : ';'
11>C:\Program Files (x86)\Windows Kits\8.1\Include\um\winnt.h(17594): error C2059: syntax error : ')'
11>C:\Program Files (x86)\Windows Kits\8.1\Include\um\interlockedapi.h(51): error C2146: syntax error : missing ')' before identifier 'ListHead'
11>C:\Program Files (x86)\Windows Kits\8.1\Include\um\interlockedapi.h(51): error C2061: syntax error : identifier 'ListHead'
11>C:\Program Files (x86)\Windows Kits\8.1\Include\um\interlockedapi.h(51): error C2059: syntax error : ';'
11>C:\Program Files (x86)\Windows Kits\8.1\Include\um\interlockedapi.h(52): error C2059: syntax error : ')'
11>C:\Program Files (x86)\Windows Kits\8.1\Include\um\interlockedapi.h(59): error C2146: syntax error : missing ')' before identifier 'ListHead'
11>C:\Program Files (x86)\Windows Kits\8.1\Include\um\interlockedapi.h(59): error C2061: syntax error : identifier 'ListHead'
11>C:\Program Files (x86)\Windows Kits\8.1\Include\um\interlockedapi.h(59): error C2059: syntax error : ';'
11>C:\Program Files (x86)\Windows Kits\8.1\Include\um\interlockedapi.h(60): error C2059: syntax error : ')'
11>C:\Program Files (x86)\Windows Kits\8.1\Include\um\interlockedapi.h(67): error C2146: syntax error : missing ')' before identifier 'ListHead'
11>C:\Program Files (x86)\Windows Kits\8.1\Include\um\interlockedapi.h(67): error C2061: syntax error : identifier 'ListHead'
11>C:\Program Files (x86)\Windows Kits\8.1\Include\um\interlockedapi.h(67): error C2059: syntax error : ';'
11>C:\Program Files (x86)\Windows Kits\8.1\Include\um\interlockedapi.h(67): error C2059: syntax error : ','
11>C:\Program Files (x86)\Windows Kits\8.1\Include\um\interlockedapi.h(69): error C2059: syntax error : ')'
11>C:\Program Files (x86)\Windows Kits\8.1\Include\um\interlockedapi.h(81): error C2146: syntax error : missing ')' before identifier 'ListHead'
11>C:\Program Files (x86)\Windows Kits\8.1\Include\um\interlockedapi.h(81): error C2061: syntax error : identifier 'ListHead'
11>C:\Program Files (x86)\Windows Kits\8.1\Include\um\interlockedapi.h(81): error C2059: syntax error : ';'
11>C:\Program Files (x86)\Windows Kits\8.1\Include\um\interlockedapi.h(81): error C2059: syntax error : ','
11>C:\Program Files (x86)\Windows Kits\8.1\Include\um\interlockedapi.h(85): error C2059: syntax error : ')'
11>C:\Program Files (x86)\Windows Kits\8.1\Include\um\interlockedapi.h(94): error C2146: syntax error : missing ')' before identifier 'ListHead'
11>C:\Program Files (x86)\Windows Kits\8.1\Include\um\interlockedapi.h(94): error C2061: syntax error : identifier 'ListHead'
11>C:\Program Files (x86)\Windows Kits\8.1\Include\um\interlockedapi.h(94): error C2059: syntax error : ';'
11>C:\Program Files (x86)\Windows Kits\8.1\Include\um\interlockedapi.h(95): error C2059: syntax error : ')'
11>C:\Program Files (x86)\Windows Kits\8.1\Include\um\interlockedapi.h(102): error C2146: syntax error : missing ')' before identifier 'ListHead'
11>C:\Program Files (x86)\Windows Kits\8.1\Include\um\interlockedapi.h(102): error C2061: syntax error : identifier 'ListHead'
11>C:\Program Files (x86)\Windows Kits\8.1\Include\um\interlockedapi.h(102): error C2059: syntax error : ';'
11>C:\Program Files (x86)\Windows Kits\8.1\Include\um\interlockedapi.h(103): error C2059: syntax error : ')'
13> Generating version number in '.\include\version_number.h' ...
13> ..\..\..\..\scripts_lgpl\win32\update_version.cmd: 000000
13> ..\..\..\..\scripts_lgpl\win32\update_version.cmd: Regenerating existing file '.\include\version_number.h'.
13> Generating version number in '.\include\version_number.rc' ...
13> ..\..\..\..\scripts_lgpl\win32\update_version.cmd: 000000
13> ..\..\..\..\scripts_lgpl\win32\update_version.cmd: Regenerating existing file '.\include\version_number.rc'.
11>src\c2c.c(923): warning C4018: '<' : signed/unsigned mismatch
11>src\c2c.c(983): warning C4018: '<' : signed/unsigned mismatch
11> df.c
11>C:\Program Files (x86)\Microsoft Visual Studio 12.0\VC\include\string.h(121): warning C4391: 'size_t strlen(const char *)' : incorrect return type for intrinsic function, expected 'unsigned int'
11>C:\Program Files (x86)\Microsoft Visual Studio 12.0\VC\include\string.h(296): warning C4391: 'size_t wcslen(const wchar_t *)' : incorrect return type for intrinsic function, expected 'unsigned int'
11>C:\Program Files (x86)\Windows Kits\8.1\Include\um\winnt.h(17546): error C2146: syntax error : missing ')' before identifier 'ListHead'
11>C:\Program Files (x86)\Windows Kits\8.1\Include\um\winnt.h(17546): error C2061: syntax error : identifier 'ListHead'
12> f2c.c
11>C:\Program Files (x86)\Windows Kits\8.1\Include\um\winnt.h(17546): error C2059: syntax error : ';'
11>C:\Program Files (x86)\Windows Kits\8.1\Include\um\winnt.h(17547): error C2059: syntax error : ')'
11>C:\Program Files (x86)\Windows Kits\8.1\Include\um\winnt.h(17554): error C2143: syntax error : missing ')' before '*'
11>C:\Program Files (x86)\Windows Kits\8.1\Include\um\winnt.h(17554): error C2143: syntax error : missing '{' before '*'
11>C:\Program Files (x86)\Windows Kits\8.1\Include\um\winnt.h(17555): error C2059: syntax error : ')'
11>C:\Program Files (x86)\Windows Kits\8.1\Include\um\winnt.h(17561): error C2146: syntax error : missing ')' before identifier 'ListHead'
11>C:\Program Files (x86)\Windows Kits\8.1\Include\um\winnt.h(17561): error C2061: syntax error : identifier 'ListHead'
11>C:\Program Files (x86)\Windows Kits\8.1\Include\um\winnt.h(17561): error C2059: syntax error : ';'
11>C:\Program Files (x86)\Windows Kits\8.1\Include\um\winnt.h(17562): error C2059: syntax error : ')'
11>C:\Program Files (x86)\Windows Kits\8.1\Include\um\winnt.h(17568): error C2146: syntax error : missing ')' before identifier 'ListHead'
11>C:\Program Files (x86)\Windows Kits\8.1\Include\um\winnt.h(17568): error C2061: syntax error : identifier 'ListHead'
11>C:\Program Files (x86)\Windows Kits\8.1\Include\um\winnt.h(17568): error C2059: syntax error : ';'
11>C:\Program Files (x86)\Windows Kits\8.1\Include\um\winnt.h(17568): error C2059: syntax error : ','
11>C:\Program Files (x86)\Windows Kits\8.1\Include\um\winnt.h(17570): error C2059: syntax error : ')'
11>C:\Program Files (x86)\Windows Kits\8.1\Include\um\winnt.h(17576): error C2146: syntax error : missing ')' before identifier 'ListHead'
11>C:\Program Files (x86)\Windows Kits\8.1\Include\um\winnt.h(17576): error C2061: syntax error : identifier 'ListHead'
11>C:\Program Files (x86)\Windows Kits\8.1\Include\um\winnt.h(17576): error C2059: syntax error : ';'
11>C:\Program Files (x86)\Windows Kits\8.1\Include\um\winnt.h(17576): error C2059: syntax error : ','
11>C:\Program Files (x86)\Windows Kits\8.1\Include\um\winnt.h(17580): error C2059: syntax error : ')'
11>C:\Program Files (x86)\Windows Kits\8.1\Include\um\winnt.h(17586): error C2146: syntax error : missing ')' before identifier 'ListHead'
11>C:\Program Files (x86)\Windows Kits\8.1\Include\um\winnt.h(17586): error C2061: syntax error : identifier 'ListHead'
11>C:\Program Files (x86)\Windows Kits\8.1\Include\um\winnt.h(17586): error C2059: syntax error : ';'
11>C:\Program Files (x86)\Windows Kits\8.1\Include\um\winnt.h(17587): error C2059: syntax error : ')'
11>C:\Program Files (x86)\Windows Kits\8.1\Include\um\winnt.h(17593): error C2146: syntax error : missing ')' before identifier 'ListHead'
11>C:\Program Files (x86)\Windows Kits\8.1\Include\um\winnt.h(17593): error C2061: syntax error : identifier 'ListHead'
11>C:\Program Files (x86)\Windows Kits\8.1\Include\um\winnt.h(17593): error C2059: syntax error : ';'
11>C:\Program Files (x86)\Windows Kits\8.1\Include\um\winnt.h(17594): error C2059: syntax error : ')'
11>C:\Program Files (x86)\Windows Kits\8.1\Include\um\interlockedapi.h(51): error C2146: syntax error : missing ')' before identifier 'ListHead'
11>C:\Program Files (x86)\Windows Kits\8.1\Include\um\interlockedapi.h(51): error C2061: syntax error : identifier 'ListHead'
11>C:\Program Files (x86)\Windows Kits\8.1\Include\um\interlockedapi.h(51): error C2059: syntax error : ';'
11>C:\Program Files (x86)\Windows Kits\8.1\Include\um\interlockedapi.h(52): error C2059: syntax error : ')'
11>C:\Program Files (x86)\Windows Kits\8.1\Include\um\interlockedapi.h(59): error C2146: syntax error : missing ')' before identifier 'ListHead'
11>C:\Program Files (x86)\Windows Kits\8.1\Include\um\interlockedapi.h(59): error C2061: syntax error : identifier 'ListHead'
11>C:\Program Files (x86)\Windows Kits\8.1\Include\um\interlockedapi.h(59): error C2059: syntax error : ';'
11>C:\Program Files (x86)\Windows Kits\8.1\Include\um\interlockedapi.h(60): error C2059: syntax error : ')'
11>C:\Program Files (x86)\Windows Kits\8.1\Include\um\interlockedapi.h(67): error C2146: syntax error : missing ')' before identifier 'ListHead'
11>C:\Program Files (x86)\Windows Kits\8.1\Include\um\interlockedapi.h(67): error C2061: syntax error : identifier 'ListHead'
11>C:\Program Files (x86)\Windows Kits\8.1\Include\um\interlockedapi.h(67): error C2059: syntax error : ';'
11>C:\Program Files (x86)\Windows Kits\8.1\Include\um\interlockedapi.h(67): error C2059: syntax error : ','
11>C:\Program Files (x86)\Windows Kits\8.1\Include\um\interlockedapi.h(69): error C2059: syntax error : ')'
11>C:\Program Files (x86)\Windows Kits\8.1\Include\um\interlockedapi.h(81): error C2146: syntax error : missing ')' before identifier 'ListHead'
11>C:\Program Files (x86)\Windows Kits\8.1\Include\um\interlockedapi.h(81): error C2061: syntax error : identifier 'ListHead'
11>C:\Program Files (x86)\Windows Kits\8.1\Include\um\interlockedapi.h(81): error C2059: syntax error : ';'
11>C:\Program Files (x86)\Windows Kits\8.1\Include\um\interlockedapi.h(81): error C2059: syntax error : ','
11>C:\Program Files (x86)\Windows Kits\8.1\Include\um\interlockedapi.h(85): error C2059: syntax error : ')'
11>C:\Program Files (x86)\Windows Kits\8.1\Include\um\interlockedapi.h(94): error C2146: syntax error : missing ')' before identifier 'ListHead'
11>C:\Program Files (x86)\Windows Kits\8.1\Include\um\interlockedapi.h(94): error C2061: syntax error : identifier 'ListHead'
11>C:\Program Files (x86)\Windows Kits\8.1\Include\um\interlockedapi.h(94): error C2059: syntax error : ';'
11>C:\Program Files (x86)\Windows Kits\8.1\Include\um\interlockedapi.h(95): error C2059: syntax error : ')'
11>C:\Program Files (x86)\Windows Kits\8.1\Include\um\interlockedapi.h(102): error C2146: syntax error : missing ')' before identifier 'ListHead'
11>C:\Program Files (x86)\Windows Kits\8.1\Include\um\interlockedapi.h(102): error C2061: syntax error : identifier 'ListHead'
11>C:\Program Files (x86)\Windows Kits\8.1\Include\um\interlockedapi.h(102): error C2059: syntax error : ';'
11>C:\Program Files (x86)\Windows Kits\8.1\Include\um\interlockedapi.h(103): error C2059: syntax error : ')'
11> er.c
11>C:\Program Files (x86)\Microsoft Visual Studio 12.0\VC\include\string.h(121): warning C4391: 'size_t strlen(const char *)' : incorrect return type for intrinsic function, expected 'unsigned int'
11>C:\Program Files (x86)\Microsoft Visual Studio 12.0\VC\include\string.h(296): warning C4391: 'size_t wcslen(const wchar_t *)' : incorrect return type for intrinsic function, expected 'unsigned int'
11>C:\Program Files (x86)\Windows Kits\8.1\Include\um\winnt.h(17546): error C2146: syntax error : missing ')' before identifier 'ListHead'
11>C:\Program Files (x86)\Windows Kits\8.1\Include\um\winnt.h(17546): error C2061: syntax error : identifier 'ListHead'
11>C:\Program Files (x86)\Windows Kits\8.1\Include\um\winnt.h(17546): error C2059: syntax error : ';'
11>C:\Program Files (x86)\Windows Kits\8.1\Include\um\winnt.h(17547): error C2059: syntax error : ')'
11>C:\Program Files (x86)\Windows Kits\8.1\Include\um\winnt.h(17554): error C2143: syntax error : missing ')' before '*'
11>C:\Program Files (x86)\Windows Kits\8.1\Include\um\winnt.h(17554): error C2143: syntax error : missing '{' before '*'
11>C:\Program Files (x86)\Windows Kits\8.1\Include\um\winnt.h(17555): error C2059: syntax error : ')'
11>C:\Program Files (x86)\Windows Kits\8.1\Include\um\winnt.h(17561): error C2146: syntax error : missing ')' before identifier 'ListHead'
11>C:\Program Files (x86)\Windows Kits\8.1\Include\um\winnt.h(17561): error C2061: syntax error : identifier 'ListHead'
11>C:\Program Files (x86)\Windows Kits\8.1\Include\um\winnt.h(17561): error C2059: syntax error : ';'
11>C:\Program Files (x86)\Windows Kits\8.1\Include\um\winnt.h(17562): error C2059: syntax error : ')'
11>C:\Program Files (x86)\Windows Kits\8.1\Include\um\winnt.h(17568): error C2146: syntax error : missing ')' before identifier 'ListHead'
11>C:\Program Files (x86)\Windows Kits\8.1\Include\um\winnt.h(17568): error C2061: syntax error : identifier 'ListHead'
11>C:\Program Files (x86)\Windows Kits\8.1\Include\um\winnt.h(17568): error C2059: syntax error : ';'
11>C:\Program Files (x86)\Windows Kits\8.1\Include\um\winnt.h(17568): error C2059: syntax error : ','
11>C:\Program Files (x86)\Windows Kits\8.1\Include\um\winnt.h(17570): error C2059: syntax error : ')'
11>C:\Program Files (x86)\Windows Kits\8.1\Include\um\winnt.h(17576): error C2146: syntax error : missing ')' before identifier 'ListHead'
11>C:\Program Files (x86)\Windows Kits\8.1\Include\um\winnt.h(17576): error C2061: syntax error : identifier 'ListHead'
11>C:\Program Files (x86)\Windows Kits\8.1\Include\um\winnt.h(17576): error C2059: syntax error : ';'
11>C:\Program Files (x86)\Windows Kits\8.1\Include\um\winnt.h(17576): error C2059: syntax error : ','
11>C:\Program Files (x86)\Windows Kits\8.1\Include\um\winnt.h(17580): error C2059: syntax error : ')'
11>C:\Program Files (x86)\Windows Kits\8.1\Include\um\winnt.h(17586): error C2146: syntax error : missing ')' before identifier 'ListHead'
11>C:\Program Files (x86)\Windows Kits\8.1\Include\um\winnt.h(17586): error C2061: syntax error : identifier 'ListHead'
11>C:\Program Files (x86)\Windows Kits\8.1\Include\um\winnt.h(17586): error C2059: syntax error : ';'
11>C:\Program Files (x86)\Windows Kits\8.1\Include\um\winnt.h(17587): error C2059: syntax error : ')'
11>C:\Program Files (x86)\Windows Kits\8.1\Include\um\winnt.h(17593): error C2146: syntax error : missing ')' before identifier 'ListHead'
11>C:\Program Files (x86)\Windows Kits\8.1\Include\um\winnt.h(17593): error C2061: syntax error : identifier 'ListHead'
11>C:\Program Files (x86)\Windows Kits\8.1\Include\um\winnt.h(17593): error C2059: syntax error : ';'
11>C:\Program Files (x86)\Windows Kits\8.1\Include\um\winnt.h(17594): error C2059: syntax error : ')'
11>C:\Program Files (x86)\Windows Kits\8.1\Include\um\interlockedapi.h(51): error C2146: syntax error : missing ')' before identifier 'ListHead'
11>C:\Program Files (x86)\Windows Kits\8.1\Include\um\interlockedapi.h(51): error C2061: syntax error : identifier 'ListHead'
11>C:\Program Files (x86)\Windows Kits\8.1\Include\um\interlockedapi.h(51): error C2059: syntax error : ';'
11>C:\Program Files (x86)\Windows Kits\8.1\Include\um\interlockedapi.h(52): error C2059: syntax error : ')'
11>C:\Program Files (x86)\Windows Kits\8.1\Include\um\interlockedapi.h(59): error C2146: syntax error : missing ')' before identifier 'ListHead'
11>C:\Program Files (x86)\Windows Kits\8.1\Include\um\interlockedapi.h(59): error C2061: syntax error : identifier 'ListHead'
11>C:\Program Files (x86)\Windows Kits\8.1\Include\um\interlockedapi.h(59): error C2059: syntax error : ';'
11>C:\Program Files (x86)\Windows Kits\8.1\Include\um\interlockedapi.h(60): error C2059: syntax error : ')'
11>C:\Program Files (x86)\Windows Kits\8.1\Include\um\interlockedapi.h(67): error C2146: syntax error : missing ')' before identifier 'ListHead'
11>C:\Program Files (x86)\Windows Kits\8.1\Include\um\interlockedapi.h(67): error C2061: syntax error : identifier 'ListHead'
11>C:\Program Files (x86)\Windows Kits\8.1\Include\um\interlockedapi.h(67): error C2059: syntax error : ';'
11>C:\Program Files (x86)\Windows Kits\8.1\Include\um\interlockedapi.h(67): error C2059: syntax error : ','
11>C:\Program Files (x86)\Windows Kits\8.1\Include\um\interlockedapi.h(69): error C2059: syntax error : ')'
11>C:\Program Files (x86)\Windows Kits\8.1\Include\um\interlockedapi.h(81): error C2146: syntax error : missing ')' before identifier 'ListHead'
11>C:\Program Files (x86)\Windows Kits\8.1\Include\um\interlockedapi.h(81): error C2061: syntax error : identifier 'ListHead'
11>C:\Program Files (x86)\Windows Kits\8.1\Include\um\interlockedapi.h(81): error C2059: syntax error : ';'
11>C:\Program Files (x86)\Windows Kits\8.1\Include\um\interlockedapi.h(81): error C2059: syntax error : ','
11>C:\Program Files (x86)\Windows Kits\8.1\Include\um\interlockedapi.h(85): error C2059: syntax error : ')'
11>C:\Program Files (x86)\Windows Kits\8.1\Include\um\interlockedapi.h(94): error C2146: syntax error : missing ')' before identifier 'ListHead'
11>C:\Program Files (x86)\Windows Kits\8.1\Include\um\interlockedapi.h(94): error C2061: syntax error : identifier 'ListHead'
11>C:\Program Files (x86)\Windows Kits\8.1\Include\um\interlockedapi.h(94): error C2059: syntax error : ';'
11>C:\Program Files (x86)\Windows Kits\8.1\Include\um\interlockedapi.h(95): error C2059: syntax error : ')'
11>C:\Program Files (x86)\Windows Kits\8.1\Include\um\interlockedapi.h(102): error C2146: syntax error : missing ')' before identifier 'ListHead'
11>C:\Program Files (x86)\Windows Kits\8.1\Include\um\interlockedapi.h(102): error C2061: syntax error : identifier 'ListHead'
11>C:\Program Files (x86)\Windows Kits\8.1\Include\um\interlockedapi.h(102): error C2059: syntax error : ';'
11>C:\Program Files (x86)\Windows Kits\8.1\Include\um\interlockedapi.h(103): error C2059: syntax error : ')'
12> version.c
11> f2c.c
11>C:\Program Files (x86)\Microsoft Visual Studio 12.0\VC\include\string.h(121): warning C4391: 'size_t strlen(const char *)' : incorrect return type for intrinsic function, expected 'unsigned int'
11>C:\Program Files (x86)\Microsoft Visual Studio 12.0\VC\include\string.h(296): warning C4391: 'size_t wcslen(const wchar_t *)' : incorrect return type for intrinsic function, expected 'unsigned int'
11>C:\Program Files (x86)\Windows Kits\8.1\Include\um\winnt.h(17546): error C2146: syntax error : missing ')' before identifier 'ListHead'
11>C:\Program Files (x86)\Windows Kits\8.1\Include\um\winnt.h(17546): error C2061: syntax error : identifier 'ListHead'
11>C:\Program Files (x86)\Windows Kits\8.1\Include\um\winnt.h(17546): error C2059: syntax error : ';'
11>C:\Program Files (x86)\Windows Kits\8.1\Include\um\winnt.h(17547): error C2059: syntax error : ')'
11>C:\Program Files (x86)\Windows Kits\8.1\Include\um\winnt.h(17554): error C2143: syntax error : missing ')' before '*'
11>C:\Program Files (x86)\Windows Kits\8.1\Include\um\winnt.h(17554): error C2143: syntax error : missing '{' before '*'
11>C:\Program Files (x86)\Windows Kits\8.1\Include\um\winnt.h(17555): error C2059: syntax error : ')'
11>C:\Program Files (x86)\Windows Kits\8.1\Include\um\winnt.h(17561): error C2146: syntax error : missing ')' before identifier 'ListHead'
11>C:\Program Files (x86)\Windows Kits\8.1\Include\um\winnt.h(17561): error C2061: syntax error : identifier 'ListHead'
11>C:\Program Files (x86)\Windows Kits\8.1\Include\um\winnt.h(17561): error C2059: syntax error : ';'
11>C:\Program Files (x86)\Windows Kits\8.1\Include\um\winnt.h(17562): error C2059: syntax error : ')'
11>C:\Program Files (x86)\Windows Kits\8.1\Include\um\winnt.h(17568): error C2146: syntax error : missing ')' before identifier 'ListHead'
11>C:\Program Files (x86)\Windows Kits\8.1\Include\um\winnt.h(17568): error C2061: syntax error : identifier 'ListHead'
11>C:\Program Files (x86)\Windows Kits\8.1\Include\um\winnt.h(17568): error C2059: syntax error : ';'
11>C:\Program Files (x86)\Windows Kits\8.1\Include\um\winnt.h(17568): error C2059: syntax error : ','
11>C:\Program Files (x86)\Windows Kits\8.1\Include\um\winnt.h(17570): error C2059: syntax error : ')'
11>C:\Program Files (x86)\Windows Kits\8.1\Include\um\winnt.h(17576): error C2146: syntax error : missing ')' before identifier 'ListHead'
11>C:\Program Files (x86)\Windows Kits\8.1\Include\um\winnt.h(17576): error C2061: syntax error : identifier 'ListHead'
11>C:\Program Files (x86)\Windows Kits\8.1\Include\um\winnt.h(17576): error C2059: syntax error : ';'
11>C:\Program Files (x86)\Windows Kits\8.1\Include\um\winnt.h(17576): error C2059: syntax error : ','
11>C:\Program Files (x86)\Windows Kits\8.1\Include\um\winnt.h(17580): error C2059: syntax error : ')'
11>C:\Program Files (x86)\Windows Kits\8.1\Include\um\winnt.h(17586): error C2146: syntax error : missing ')' before identifier 'ListHead'
11>C:\Program Files (x86)\Windows Kits\8.1\Include\um\winnt.h(17586): error C2061: syntax error : identifier 'ListHead'
11>C:\Program Files (x86)\Windows Kits\8.1\Include\um\winnt.h(17586): error C2059: syntax error : ';'
11>C:\Program Files (x86)\Windows Kits\8.1\Include\um\winnt.h(17587): error C2059: syntax error : ')'
11>C:\Program Files (x86)\Windows Kits\8.1\Include\um\winnt.h(17593): error C2146: syntax error : missing ')' before identifier 'ListHead'
11>C:\Program Files (x86)\Windows Kits\8.1\Include\um\winnt.h(17593): error C2061: syntax error : identifier 'ListHead'
11>C:\Program Files (x86)\Windows Kits\8.1\Include\um\winnt.h(17593): error C2059: syntax error : ';'
11>C:\Program Files (x86)\Windows Kits\8.1\Include\um\winnt.h(17594): error C2059: syntax error : ')'
11>C:\Program Files (x86)\Windows Kits\8.1\Include\um\interlockedapi.h(51): error C2146: syntax error : missing ')' before identifier 'ListHead'
11>C:\Program Files (x86)\Windows Kits\8.1\Include\um\interlockedapi.h(51): error C2061: syntax error : identifier 'ListHead'
11>C:\Program Files (x86)\Windows Kits\8.1\Include\um\interlockedapi.h(51): error C2059: syntax error : ';'
11>C:\Program Files (x86)\Windows Kits\8.1\Include\um\interlockedapi.h(52): error C2059: syntax error : ')'
11>C:\Program Files (x86)\Windows Kits\8.1\Include\um\interlockedapi.h(59): error C2146: syntax error : missing ')' before identifier 'ListHead'
11>C:\Program Files (x86)\Windows Kits\8.1\Include\um\interlockedapi.h(59): error C2061: syntax error : identifier 'ListHead'
11>C:\Program Files (x86)\Windows Kits\8.1\Include\um\interlockedapi.h(59): error C2059: syntax error : ';'
11>C:\Program Files (x86)\Windows Kits\8.1\Include\um\interlockedapi.h(60): error C2059: syntax error : ')'
11>C:\Program Files (x86)\Windows Kits\8.1\Include\um\interlockedapi.h(67): error C2146: syntax error : missing ')' before identifier 'ListHead'
11>C:\Program Files (x86)\Windows Kits\8.1\Include\um\interlockedapi.h(67): error C2061: syntax error : identifier 'ListHead'
11>C:\Program Files (x86)\Windows Kits\8.1\Include\um\interlockedapi.h(67): error C2059: syntax error : ';'
11>C:\Program Files (x86)\Windows Kits\8.1\Include\um\interlockedapi.h(67): error C2059: syntax error : ','
11>C:\Program Files (x86)\Windows Kits\8.1\Include\um\interlockedapi.h(69): error C2059: syntax error : ')'
11>C:\Program Files (x86)\Windows Kits\8.1\Include\um\interlockedapi.h(81): error C2146: syntax error : missing ')' before identifier 'ListHead'
11>C:\Program Files (x86)\Windows Kits\8.1\Include\um\interlockedapi.h(81): error C2061: syntax error : identifier 'ListHead'
11>C:\Program Files (x86)\Windows Kits\8.1\Include\um\interlockedapi.h(81): error C2059: syntax error : ';'
11>C:\Program Files (x86)\Windows Kits\8.1\Include\um\interlockedapi.h(81): error C2059: syntax error : ','
11>C:\Program Files (x86)\Windows Kits\8.1\Include\um\interlockedapi.h(85): error C2059: syntax error : ')'
11>C:\Program Files (x86)\Windows Kits\8.1\Include\um\interlockedapi.h(94): error C2146: syntax error : missing ')' before identifier 'ListHead'
11>C:\Program Files (x86)\Windows Kits\8.1\Include\um\interlockedapi.h(94): error C2061: syntax error : identifier 'ListHead'
11>C:\Program Files (x86)\Windows Kits\8.1\Include\um\interlockedapi.h(94): error C2059: syntax error : ';'
11>C:\Program Files (x86)\Windows Kits\8.1\Include\um\interlockedapi.h(95): error C2059: syntax error : ')'
11>C:\Program Files (x86)\Windows Kits\8.1\Include\um\interlockedapi.h(102): error C2146: syntax error : missing ')' before identifier 'ListHead'
11>C:\Program Files (x86)\Windows Kits\8.1\Include\um\interlockedapi.h(102): error C2061: syntax error : identifier 'ListHead'
11>C:\Program Files (x86)\Windows Kits\8.1\Include\um\interlockedapi.h(102): error C2059: syntax error : ';'
11>C:\Program Files (x86)\Windows Kits\8.1\Include\um\interlockedapi.h(103): error C2059: syntax error : ')'
12> delwaq1_version_number.vcxproj -> C:\Delft\Wave\releases\4440\src\engines_gpl\waq\packages\delwaq1_version_number\.\lib\Release\delwaq1_version_number.lib
13> c2c.c
9>src\d_hydro.cpp(156): warning C4996: '_splitpath': This function or variable may be unsafe. Consider using _splitpath_s instead. To disable deprecation, use _CRT_SECURE_NO_WARNINGS. See online help for details.
9> C:\Program Files (x86)\Microsoft Visual Studio 12.0\VC\include\stdlib.h(854) : see declaration of '_splitpath'
9>src\d_hydro.cpp(191): warning C4996: 'sscanf': This function or variable may be unsafe. Consider using sscanf_s instead. To disable deprecation, use _CRT_SECURE_NO_WARNINGS. See online help for details.
9> C:\Program Files (x86)\Microsoft Visual Studio 12.0\VC\include\stdio.h(304) : see declaration of 'sscanf'
9>src\d_hydro.cpp(197): warning C4996: 'fopen': This function or variable may be unsafe. Consider using fopen_s instead. To disable deprecation, use _CRT_SECURE_NO_WARNINGS. See online help for details.
9> C:\Program Files (x86)\Microsoft Visual Studio 12.0\VC\include\stdio.h(211) : see declaration of 'fopen'
9>src\d_hydro.cpp(240): warning C4996: 'fopen': This function or variable may be unsafe. Consider using fopen_s instead. To disable deprecation, use _CRT_SECURE_NO_WARNINGS. See online help for details.
9> C:\Program Files (x86)\Microsoft Visual Studio 12.0\VC\include\stdio.h(211) : see declaration of 'fopen'
9>src\d_hydro.cpp(316): warning C4996: 'sprintf': This function or variable may be unsafe. Consider using sprintf_s instead. To disable deprecation, use _CRT_SECURE_NO_WARNINGS. See online help for details.
9> C:\Program Files (x86)\Microsoft Visual Studio 12.0\VC\include\stdio.h(356) : see declaration of 'sprintf'
9>src\d_hydro.cpp(332): warning C4800: 'int' : forcing value to bool 'true' or 'false' (performance warning)
9> d_hydro_version.cpp
9>src\d_hydro_version.cpp(57): warning C4996: 'strncpy': This function or variable may be unsafe. Consider using strncpy_s instead. To disable deprecation, use _CRT_SECURE_NO_WARNINGS. See online help for details.
9> C:\Program Files (x86)\Microsoft Visual Studio 12.0\VC\include\string.h(195) : see declaration of 'strncpy'
9>src\d_hydro_version.cpp(65): warning C4996: 'strncpy': This function or variable may be unsafe. Consider using strncpy_s instead. To disable deprecation, use _CRT_SECURE_NO_WARNINGS. See online help for details.
9> C:\Program Files (x86)\Microsoft Visual Studio 12.0\VC\include\string.h(195) : see declaration of 'strncpy'
9>src\d_hydro_version.cpp(73): warning C4996: 'strncpy': This function or variable may be unsafe. Consider using strncpy_s instead. To disable deprecation, use _CRT_SECURE_NO_WARNINGS. See online help for details.
9> C:\Program Files (x86)\Microsoft Visual Studio 12.0\VC\include\string.h(195) : see declaration of 'strncpy'
13> f2c.c
13> version.c
11> hs.c
11>C:\Program Files (x86)\Microsoft Visual Studio 12.0\VC\include\string.h(121): warning C4391: 'size_t strlen(const char *)' : incorrect return type for intrinsic function, expected 'unsigned int'
11>C:\Program Files (x86)\Microsoft Visual Studio 12.0\VC\include\string.h(296): warning C4391: 'size_t wcslen(const wchar_t *)' : incorrect return type for intrinsic function, expected 'unsigned int'
11>C:\Program Files (x86)\Windows Kits\8.1\Include\um\winnt.h(17546): error C2146: syntax error : missing ')' before identifier 'ListHead'
11>C:\Program Files (x86)\Windows Kits\8.1\Include\um\winnt.h(17546): error C2061: syntax error : identifier 'ListHead'
11>C:\Program Files (x86)\Windows Kits\8.1\Include\um\winnt.h(17546): error C2059: syntax error : ';'
11>C:\Program Files (x86)\Windows Kits\8.1\Include\um\winnt.h(17547): error C2059: syntax error : ')'
11>C:\Program Files (x86)\Windows Kits\8.1\Include\um\winnt.h(17554): error C2143: syntax error : missing ')' before '*'
11>C:\Program Files (x86)\Windows Kits\8.1\Include\um\winnt.h(17554): error C2143: syntax error : missing '{' before '*'
11>C:\Program Files (x86)\Windows Kits\8.1\Include\um\winnt.h(17555): error C2059: syntax error : ')'
11>C:\Program Files (x86)\Windows Kits\8.1\Include\um\winnt.h(17561): error C2146: syntax error : missing ')' before identifier 'ListHead'
11>C:\Program Files (x86)\Windows Kits\8.1\Include\um\winnt.h(17561): error C2061: syntax error : identifier 'ListHead'
11>C:\Program Files (x86)\Windows Kits\8.1\Include\um\winnt.h(17561): error C2059: syntax error : ';'
11>C:\Program Files (x86)\Windows Kits\8.1\Include\um\winnt.h(17562): error C2059: syntax error : ')'
11>C:\Program Files (x86)\Windows Kits\8.1\Include\um\winnt.h(17568): error C2146: syntax error : missing ')' before identifier 'ListHead'
11>C:\Program Files (x86)\Windows Kits\8.1\Include\um\winnt.h(17568): error C2061: syntax error : identifier 'ListHead'
11>C:\Program Files (x86)\Windows Kits\8.1\Include\um\winnt.h(17568): error C2059: syntax error : ';'
11>C:\Program Files (x86)\Windows Kits\8.1\Include\um\winnt.h(17568): error C2059: syntax error : ','
11>C:\Program Files (x86)\Windows Kits\8.1\Include\um\winnt.h(17570): error C2059: syntax error : ')'
11>C:\Program Files (x86)\Windows Kits\8.1\Include\um\winnt.h(17576): error C2146: syntax error : missing ')' before identifier 'ListHead'
11>C:\Program Files (x86)\Windows Kits\8.1\Include\um\winnt.h(17576): error C2061: syntax error : identifier 'ListHead'
11>C:\Program Files (x86)\Windows Kits\8.1\Include\um\winnt.h(17576): error C2059: syntax error : ';'
11>C:\Program Files (x86)\Windows Kits\8.1\Include\um\winnt.h(17576): error C2059: syntax error : ','
11>C:\Program Files (x86)\Windows Kits\8.1\Include\um\winnt.h(17580): error C2059: syntax error : ')'
11>C:\Program Files (x86)\Windows Kits\8.1\Include\um\winnt.h(17586): error C2146: syntax error : missing ')' before identifier 'ListHead'
11>C:\Program Files (x86)\Windows Kits\8.1\Include\um\winnt.h(17586): error C2061: syntax error : identifier 'ListHead'
11>C:\Program Files (x86)\Windows Kits\8.1\Include\um\winnt.h(17586): error C2059: syntax error : ';'
11>C:\Program Files (x86)\Windows Kits\8.1\Include\um\winnt.h(17587): error C2059: syntax error : ')'
11>C:\Program Files (x86)\Windows Kits\8.1\Include\um\winnt.h(17593): error C2146: syntax error : missing ')' before identifier 'ListHead'
11>C:\Program Files (x86)\Windows Kits\8.1\Include\um\winnt.h(17593): error C2061: syntax error : identifier 'ListHead'
11>C:\Program Files (x86)\Windows Kits\8.1\Include\um\winnt.h(17593): error C2059: syntax error : ';'
11>C:\Program Files (x86)\Windows Kits\8.1\Include\um\winnt.h(17594): error C2059: syntax error : ')'
14>------ Build started: Project: waq_run_processes_version_number, Configuration: Release Win32 ------
13> delwaq2_version_number.vcxproj -> C:\Delft\Wave\releases\4440\src\engines_gpl\waq\packages\delwaq2_version_number\.\lib\Release\delwaq2_version_number.lib
11>C:\Program Files (x86)\Windows Kits\8.1\Include\um\interlockedapi.h(51): error C2146: syntax error : missing ')' before identifier 'ListHead'
11>C:\Program Files (x86)\Windows Kits\8.1\Include\um\interlockedapi.h(51): error C2061: syntax error : identifier 'ListHead'
11>C:\Program Files (x86)\Windows Kits\8.1\Include\um\interlockedapi.h(51): error C2059: syntax error : ';'
11>C:\Program Files (x86)\Windows Kits\8.1\Include\um\interlockedapi.h(52): error C2059: syntax error : ')'
11>C:\Program Files (x86)\Windows Kits\8.1\Include\um\interlockedapi.h(59): error C2146: syntax error : missing ')' before identifier 'ListHead'
11>C:\Program Files (x86)\Windows Kits\8.1\Include\um\interlockedapi.h(59): error C2061: syntax error : identifier 'ListHead'
11>C:\Program Files (x86)\Windows Kits\8.1\Include\um\interlockedapi.h(59): error C2059: syntax error : ';'
11>C:\Program Files (x86)\Windows Kits\8.1\Include\um\interlockedapi.h(60): error C2059: syntax error : ')'
11>C:\Program Files (x86)\Windows Kits\8.1\Include\um\interlockedapi.h(67): error C2146: syntax error : missing ')' before identifier 'ListHead'
11>C:\Program Files (x86)\Windows Kits\8.1\Include\um\interlockedapi.h(67): error C2061: syntax error : identifier 'ListHead'
11>C:\Program Files (x86)\Windows Kits\8.1\Include\um\interlockedapi.h(67): error C2059: syntax error : ';'
11>C:\Program Files (x86)\Windows Kits\8.1\Include\um\interlockedapi.h(67): error C2059: syntax error : ','
11>C:\Program Files (x86)\Windows Kits\8.1\Include\um\interlockedapi.h(69): error C2059: syntax error : ')'
11>C:\Program Files (x86)\Windows Kits\8.1\Include\um\interlockedapi.h(81): error C2146: syntax error : missing ')' before identifier 'ListHead'
11>C:\Program Files (x86)\Windows Kits\8.1\Include\um\interlockedapi.h(81): error C2061: syntax error : identifier 'ListHead'
11>C:\Program Files (x86)\Windows Kits\8.1\Include\um\interlockedapi.h(81): error C2059: syntax error : ';'
11>C:\Program Files (x86)\Windows Kits\8.1\Include\um\interlockedapi.h(81): error C2059: syntax error : ','
11>C:\Program Files (x86)\Windows Kits\8.1\Include\um\interlockedapi.h(85): error C2059: syntax error : ')'
11>C:\Program Files (x86)\Windows Kits\8.1\Include\um\interlockedapi.h(94): error C2146: syntax error : missing ')' before identifier 'ListHead'
11>C:\Program Files (x86)\Windows Kits\8.1\Include\um\interlockedapi.h(94): error C2061: syntax error : identifier 'ListHead'
11>C:\Program Files (x86)\Windows Kits\8.1\Include\um\interlockedapi.h(94): error C2059: syntax error : ';'
11>C:\Program Files (x86)\Windows Kits\8.1\Include\um\interlockedapi.h(95): error C2059: syntax error : ')'
11>C:\Program Files (x86)\Windows Kits\8.1\Include\um\interlockedapi.h(102): error C2146: syntax error : missing ')' before identifier 'ListHead'
11>C:\Program Files (x86)\Windows Kits\8.1\Include\um\interlockedapi.h(102): error C2061: syntax error : identifier 'ListHead'
11>C:\Program Files (x86)\Windows Kits\8.1\Include\um\interlockedapi.h(102): error C2059: syntax error : ';'
11>C:\Program Files (x86)\Windows Kits\8.1\Include\um\interlockedapi.h(103): error C2059: syntax error : ')'
11>src\hs.c(353): warning C4244: '=' : conversion from 'BUInt8' to 'BInt4', possible loss of data
11> oc.c
11>C:\Program Files (x86)\Microsoft Visual Studio 12.0\VC\include\string.h(121): warning C4391: 'size_t strlen(const char *)' : incorrect return type for intrinsic function, expected 'unsigned int'
11>C:\Program Files (x86)\Microsoft Visual Studio 12.0\VC\include\string.h(296): warning C4391: 'size_t wcslen(const wchar_t *)' : incorrect return type for intrinsic function, expected 'unsigned int'
14> Generating version number in '.\include\version_number.h' ...
11>C:\Program Files (x86)\Windows Kits\8.1\Include\um\winnt.h(17546): error C2146: syntax error : missing ')' before identifier 'ListHead'
11>C:\Program Files (x86)\Windows Kits\8.1\Include\um\winnt.h(17546): error C2061: syntax error : identifier 'ListHead'
11>C:\Program Files (x86)\Windows Kits\8.1\Include\um\winnt.h(17546): error C2059: syntax error : ';'
11>C:\Program Files (x86)\Windows Kits\8.1\Include\um\winnt.h(17547): error C2059: syntax error : ')'
11>C:\Program Files (x86)\Windows Kits\8.1\Include\um\winnt.h(17554): error C2143: syntax error : missing ')' before '*'
11>C:\Program Files (x86)\Windows Kits\8.1\Include\um\winnt.h(17554): error C2143: syntax error : missing '{' before '*'
11>C:\Program Files (x86)\Windows Kits\8.1\Include\um\winnt.h(17555): error C2059: syntax error : ')'
11>C:\Program Files (x86)\Windows Kits\8.1\Include\um\winnt.h(17561): error C2146: syntax error : missing ')' before identifier 'ListHead'
11>C:\Program Files (x86)\Windows Kits\8.1\Include\um\winnt.h(17561): error C2061: syntax error : identifier 'ListHead'
11>C:\Program Files (x86)\Windows Kits\8.1\Include\um\winnt.h(17561): error C2059: syntax error : ';'
11>C:\Program Files (x86)\Windows Kits\8.1\Include\um\winnt.h(17562): error C2059: syntax error : ')'
11>C:\Program Files (x86)\Windows Kits\8.1\Include\um\winnt.h(17568): error C2146: syntax error : missing ')' before identifier 'ListHead'
11>C:\Program Files (x86)\Windows Kits\8.1\Include\um\winnt.h(17568): error C2061: syntax error : identifier 'ListHead'
11>C:\Program Files (x86)\Windows Kits\8.1\Include\um\winnt.h(17568): error C2059: syntax error : ';'
11>C:\Program Files (x86)\Windows Kits\8.1\Include\um\winnt.h(17568): error C2059: syntax error : ','
11>C:\Program Files (x86)\Windows Kits\8.1\Include\um\winnt.h(17570): error C2059: syntax error : ')'
11>C:\Program Files (x86)\Windows Kits\8.1\Include\um\winnt.h(17576): error C2146: syntax error : missing ')' before identifier 'ListHead'
11>C:\Program Files (x86)\Windows Kits\8.1\Include\um\winnt.h(17576): error C2061: syntax error : identifier 'ListHead'
11>C:\Program Files (x86)\Windows Kits\8.1\Include\um\winnt.h(17576): error C2059: syntax error : ';'
11>C:\Program Files (x86)\Windows Kits\8.1\Include\um\winnt.h(17576): error C2059: syntax error : ','
11>C:\Program Files (x86)\Windows Kits\8.1\Include\um\winnt.h(17580): error C2059: syntax error : ')'
11>C:\Program Files (x86)\Windows Kits\8.1\Include\um\winnt.h(17586): error C2146: syntax error : missing ')' before identifier 'ListHead'
11>C:\Program Files (x86)\Windows Kits\8.1\Include\um\winnt.h(17586): error C2061: syntax error : identifier 'ListHead'
11>C:\Program Files (x86)\Windows Kits\8.1\Include\um\winnt.h(17586): error C2059: syntax error : ';'
11>C:\Program Files (x86)\Windows Kits\8.1\Include\um\winnt.h(17587): error C2059: syntax error : ')'
11>C:\Program Files (x86)\Windows Kits\8.1\Include\um\winnt.h(17593): error C2146: syntax error : missing ')' before identifier 'ListHead'
11>C:\Program Files (x86)\Windows Kits\8.1\Include\um\winnt.h(17593): error C2061: syntax error : identifier 'ListHead'
11>C:\Program Files (x86)\Windows Kits\8.1\Include\um\winnt.h(17593): error C2059: syntax error : ';'
11>C:\Program Files (x86)\Windows Kits\8.1\Include\um\winnt.h(17594): error C2059: syntax error : ')'
11>C:\Program Files (x86)\Windows Kits\8.1\Include\um\interlockedapi.h(51): error C2146: syntax error : missing ')' before identifier 'ListHead'
11>C:\Program Files (x86)\Windows Kits\8.1\Include\um\interlockedapi.h(51): error C2061: syntax error : identifier 'ListHead'
11>C:\Program Files (x86)\Windows Kits\8.1\Include\um\interlockedapi.h(51): error C2059: syntax error : ';'
11>C:\Program Files (x86)\Windows Kits\8.1\Include\um\interlockedapi.h(52): error C2059: syntax error : ')'
11>C:\Program Files (x86)\Windows Kits\8.1\Include\um\interlockedapi.h(59): error C2146: syntax error : missing ')' before identifier 'ListHead'
11>C:\Program Files (x86)\Windows Kits\8.1\Include\um\interlockedapi.h(59): error C2061: syntax error : identifier 'ListHead'
11>C:\Program Files (x86)\Windows Kits\8.1\Include\um\interlockedapi.h(59): error C2059: syntax error : ';'
11>C:\Program Files (x86)\Windows Kits\8.1\Include\um\interlockedapi.h(60): error C2059: syntax error : ')'
11>C:\Program Files (x86)\Windows Kits\8.1\Include\um\interlockedapi.h(67): error C2146: syntax error : missing ')' before identifier 'ListHead'
11>C:\Program Files (x86)\Windows Kits\8.1\Include\um\interlockedapi.h(67): error C2061: syntax error : identifier 'ListHead'
11>C:\Program Files (x86)\Windows Kits\8.1\Include\um\interlockedapi.h(67): error C2059: syntax error : ';'
11>C:\Program Files (x86)\Windows Kits\8.1\Include\um\interlockedapi.h(67): error C2059: syntax error : ','
11>C:\Program Files (x86)\Windows Kits\8.1\Include\um\interlockedapi.h(69): error C2059: syntax error : ')'
11>C:\Program Files (x86)\Windows Kits\8.1\Include\um\interlockedapi.h(81): error C2146: syntax error : missing ')' before identifier 'ListHead'
11>C:\Program Files (x86)\Windows Kits\8.1\Include\um\interlockedapi.h(81): error C2061: syntax error : identifier 'ListHead'
11>C:\Program Files (x86)\Windows Kits\8.1\Include\um\interlockedapi.h(81): error C2059: syntax error : ';'
11>C:\Program Files (x86)\Windows Kits\8.1\Include\um\interlockedapi.h(81): error C2059: syntax error : ','
11>C:\Program Files (x86)\Windows Kits\8.1\Include\um\interlockedapi.h(85): error C2059: syntax error : ')'
11>C:\Program Files (x86)\Windows Kits\8.1\Include\um\interlockedapi.h(94): error C2146: syntax error : missing ')' before identifier 'ListHead'
11>C:\Program Files (x86)\Windows Kits\8.1\Include\um\interlockedapi.h(94): error C2061: syntax error : identifier 'ListHead'
11>C:\Program Files (x86)\Windows Kits\8.1\Include\um\interlockedapi.h(94): error C2059: syntax error : ';'
11>C:\Program Files (x86)\Windows Kits\8.1\Include\um\interlockedapi.h(95): error C2059: syntax error : ')'
11>C:\Program Files (x86)\Windows Kits\8.1\Include\um\interlockedapi.h(102): error C2146: syntax error : missing ')' before identifier 'ListHead'
11>C:\Program Files (x86)\Windows Kits\8.1\Include\um\interlockedapi.h(102): error C2061: syntax error : identifier 'ListHead'
11>C:\Program Files (x86)\Windows Kits\8.1\Include\um\interlockedapi.h(102): error C2059: syntax error : ';'
11>C:\Program Files (x86)\Windows Kits\8.1\Include\um\interlockedapi.h(103): error C2059: syntax error : ')'
9>LINK : fatal error LNK1181: cannot open input file '..\..\..\..\utils_lgpl\deltares_common\lib\Release\static\deltares_common.lib'
14> ..\..\..\..\scripts_lgpl\win32\update_version.cmd: 000000
14> ..\..\..\..\scripts_lgpl\win32\update_version.cmd: Regenerating existing file '.\include\version_number.h'.
14> Generating version number in '.\include\version_number.rc' ...
14> ..\..\..\..\scripts_lgpl\win32\update_version.cmd: 000000
14> ..\..\..\..\scripts_lgpl\win32\update_version.cmd: Regenerating existing file '.\include\version_number.rc'.
14> c2c.c
11>src\oc.c(74): warning C4005: 'FILE_READ_ONLY' : macro redefinition
11> C:\Program Files (x86)\Windows Kits\8.1\Include\um\winbase.h(2517) : see previous definition of 'FILE_READ_ONLY'
14> f2c.c
14> version.c
15>------ Build started: Project: flow2d3d_intel13, Configuration: Release Win32 ------
14> waq_run_processes_version_number.vcxproj -> C:\Delft\Wave\releases\4440\src\tools_gpl\waq_run_processes\packages\waq_run_processes_version_number\bin\Release\waq_run_processes_version_number.lib
16>------ Build started: Project: vs_version_number, Configuration: Release Win32 ------
17>------ Build started: Project: datsel_intel13, Configuration: Release Win32 ------
15>C:\Program Files (x86)\MSBuild\Microsoft.Cpp\v4.0\V120\Microsoft.Cpp.Platform.targets(64,5): error MSB8020: The build tools for Visual Studio 2010 (Platform Toolset = 'v100') cannot be found. To build using the v100 build tools, please install Visual Studio 2010 build tools. Alternatively, you may upgrade to the current Visual Studio tools by selecting the Project menu or right-click the solution, and then selecting "Upgrade Solution...".
18>------ Build started: Project: flow2d3d_openda_intel13, Configuration: Release Win32 ------
17>C:\Program Files (x86)\MSBuild\Microsoft.Cpp\v4.0\V120\Microsoft.Cpp.Platform.targets(64,5): error MSB8020: The build tools for Visual Studio 2010 (Platform Toolset = 'v100') cannot be found. To build using the v100 build tools, please install Visual Studio 2010 build tools. Alternatively, you may upgrade to the current Visual Studio tools by selecting the Project menu or right-click the solution, and then selecting "Upgrade Solution...".
19>------ Build started: Project: delpar, Configuration: Release Win32 ------
18>C:\Program Files (x86)\MSBuild\Microsoft.Cpp\v4.0\V120\Microsoft.Cpp.Platform.targets(64,5): error MSB8020: The build tools for Visual Studio 2010 (Platform Toolset = 'v100') cannot be found. To build using the v100 build tools, please install Visual Studio 2010 build tools. Alternatively, you may upgrade to the current Visual Studio tools by selecting the Project menu or right-click the solution, and then selecting "Upgrade Solution...".
16> Generating version number in '.\include\version_number.h' ...
19>C:\Program Files (x86)\MSBuild\Microsoft.Cpp\v4.0\V120\Microsoft.CppBuild.targets(363,5): warning MSB8004: Intermediate Directory does not end with a trailing slash. This build instance will add the slash as it is required to allow proper evaluation of the Intermediate Directory.
19>C:\Program Files (x86)\MSBuild\Microsoft.Cpp\v4.0\V120\Microsoft.CppBuild.targets(364,5): warning MSB8004: Output Directory does not end with a trailing slash. This build instance will add the slash as it is required to allow proper evaluation of the Output Directory.
16> ..\..\..\..\scripts_lgpl\win32\update_version.cmd: 000000
16> ..\..\..\..\scripts_lgpl\win32\update_version.cmd: Regenerating existing file '.\include\version_number.h'.
16> Generating version number in '.\include\version_number.rc' ...
19>..\version_number\include\version_number.rc(10): fatal error RC1015: cannot open include file 'afxres.h'.
19>
16> ..\..\..\..\scripts_lgpl\win32\update_version.cmd: 000000
16> ..\..\..\..\scripts_lgpl\win32\update_version.cmd: Regenerating existing file '.\include\version_number.rc'.
16> c2c.c
16> f2c.c
16> version.c
16> vs_version_number.vcxproj -> C:\Delft\Wave\releases\4440\src\tools_gpl\vs\packages\vs_version_number\bin\Release\vs_version_number.lib
20>------ Build started: Project: vs (tools_gpl\vs\vs), Configuration: Release Win32 ------
20> A subdirectory or file tmp already exists.
20> vs_l.c
20>vs_l.c(1546): warning C4996: 'fileno': The POSIX name for this item is deprecated. Instead, use the ISO C++ conformant name: _fileno. See online help for details.
20> C:\Program Files (x86)\Microsoft Visual Studio 12.0\VC\include\stdio.h(718) : see declaration of 'fileno'
20> vs_y.c
20>vs_y.c(529): warning C4102: 'yynewerror' : unreferenced label
20>..\vs_version_number\include\version_number.rc(10): fatal error RC1015: cannot open include file 'afxres.h'.
20>
========== Build: 9 succeeded, 11 failed, 12 up-to-date, 0 skipped ==========